{"text_format":"3","workbook":"xlsx","n_sheets":14,"sheets":["anexo_01_07","Hoja4","IMPRIMIR ANEXO 1","anexo_02_08","anexo_03_09","anexo_04_10","anexo_05_11","Hoja1","nexus","ACTA","DATA","PRINT","LISTAS","Hoja2"],"not_rendered":{"images":7,"macros":1,"defined_names":43,"comments":2},"read":"whole","date_system":"1900"}

{"sheet":"anexo_01_07","index":0,"n_rows":39,"n_cols":19,"rows_kept":39,"merged":[[2005,7,2005,8],[2006,7,2006,8],[2007,7,2007,8],[2008,7,2008,8],[2009,7,2009,8],[2010,7,2010,8],[2011,7,2011,8],[2012,7,2012,8],[2013,7,2013,8],[2014,7,2014,8],[2015,7,2015,8],[2016,7,2016,8],[2017,7,2017,8],[2018,7,2018,8],[2019,7,2019,8],[2020,7,2020,8],[2021,7,2021,8],[2022,7,2022,8],[2023,7,2023,8],[2024,7,2024,8],[2025,7,2025,8],[2026,7,2026,8],[2027,7,2027,8],[2028,7,2028,8],[2029,7,2029,8],[2030,7,2030,8],[2031,7,2031,8],[2032,7,2032,8],[2033,7,2033,8],[2034,7,2034,8],[2035,7,2035,8],[2036,7,2036,8],[2037,7,2037,8],[2038,7,2038,8],[2039,7,2039,8],[2040,7,2040,8],[2041,7,2041,8],[2042,7,2042,8],[2043,7,2043,8],[2044,7,2044,8],[2045,7,2045,8],[2046,7,2046,8],[2047,7,2047,8],[2048,7,2048,8],[2049,7,2049,8],[2050,7,2050,8],[2051,7,2051,8],[2052,7,2052,8],[2053,7,2053,8],[2054,7,2054,8],[2055,7,2055,8],[2056,7,2056,8],[2057,7,2057,8],[2058,7,2058,8],[2059,7,2059,8],[2060,7,2060,8],[2061,7,2061,8],[2062,7,2062,8],[2063,7,2063,8],[2064,7,2064,8],[2065,7,2065,8],[2066,7,2066,8],[2067,7,2067,8],[2068,7,2068,8],[2069,7,2069,8],[2070,7,2070,8],[2071,7,2071,8],[2072,7,2072,8],[2073,7,2073,8],[2074,7,2074,8],[2075,7,2075,8],[2076,7,2076,8],[2077,7,2077,8],[2078,7,2078,8],[2079,7,2079,8],[2080,7,2080,8],[2081,7,2081,8],[2082,7,2082,8],[2083,7,2083,8],[2084,7,2084,8],[2085,7,2085,8],[2086,7,2086,8],[2087,7,2087,8],[2088,7,2088,8],[2089,7,2089,8],[2090,7,2090,8],[2091,7,2091,8],[2092,7,2092,8],[2093,7,2093,8],[2094,7,2094,8],[2095,7,2095,8],[2096,7,2096,8],[2097,7,2097,8],[2098,7,2098,8],[2099,7,2099,8],[2100,7,2100,8],[2101,7,2101,8],[2102,7,2102,8],[2103,7,2103,8],[2104,7,2104,8],[2105,7,2105,8],[2106,7,2106,8],[2107,7,2107,8],[2108,7,2108,8],[2109,7,2109,8],[2110,7,2110,8],[2111,7,2111,8],[2112,7,2112,8],[2113,7,2113,8],[2114,7,2114,8],[2115,7,2115,8],[2116,7,2116,8],[2117,7,2117,8],[2118,7,2118,8],[2119,7,2119,8],[2120,7,2120,8],[2121,7,2121,8],[2122,7,2122,8],[2123,7,2123,8],[2124,7,2124,8],[2125,7,2125,8],[2126,7,2126,8],[2127,7,2127,8],[2128,7,2128,8],[2129,7,2129,8],[2130,7,2130,8],[2131,7,2131,8],[2132,7,2132,8],[2133,7,2133,8],[2134,7,2134,8],[2135,7,2135,8],[2136,7,2136,8],[2137,7,2137,8],[2138,7,2138,8],[2139,7,2139,8],[2140,7,2140,8],[2141,7,2141,8],[2142,7,2142,8],[2143,7,2143,8],[2144,7,2144,8],[2145,7,2145,8],[2146,7,2146,8],[2147,7,2147,8],[2148,7,2148,8],[2149,7,2149,8],[2150,7,2150,8],[2151,7,2151,8],[2152,7,2152,8],[2153,7,2153,8],[2154,7,2154,8],[2155,7,2155,8],[2156,7,2156,8],[2157,7,2157,8],[2158,7,2158,8],[2159,7,2159,8],[2160,7,2160,8],[2161,7,2161,8],[2162,7,2162,8],[2163,7,2163,8],[2164,7,2164,8],[2165,7,2165,8],[2166,7,2166,8],[2167,7,2167,8],[2168,7,2168,8],[2169,7,2169,8],[2170,7,2170,8],[2171,7,2171,8],[2172,7,2172,8],[2173,7,2173,8],[2174,7,2174,8],[2175,7,2175,8],[2176,7,2176,8],[2177,7,2177,8],[2178,7,2178,8],[2179,7,2179,8],[2180,7,2180,8],[2181,7,2181,8],[2182,7,2182,8],[2183,7,2183,8],[2184,7,2184,8],[2185,7,2185,8],[2186,7,2186,8],[2187,7,2187,8],[2188,7,2188,8],[2189,7,2189,8],[2190,7,2190,8],[2191,7,2191,8],[2192,7,2192,8],[2193,7,2193,8],[2194,7,2194,8],[2195,7,2195,8],[2196,7,2196,8],[2197,7,2197,8],[2198,7,2198,8],[2199,7,2199,8],[2200,7,2200,8],[2201,7,2201,8],[2202,7,2202,8],[2203,7,2203,8],[2204,7,2204,8],[2205,7,2205,8],[2206,7,2206,8],[2207,7,2207,8],[2208,7,2208,8],[2209,7,2209,8],[2210,7,2210,8],[2211,7,2211,8],[2212,7,2212,8],[2213,7,2213,8],[2214,7,2214,8],[2215,7,2215,8],[2216,7,2216,8],[2217,7,2217,8],[2218,7,2218,8],[2219,7,2219,8],[2220,7,2220,8],[2221,7,2221,8],[2222,7,2222,8],[2223,7,2223,8],[2224,7,2224,8],[2225,7,2225,8],[2226,7,2226,8],[2227,7,2227,8],[2228,7,2228,8],[2229,7,2229,8],[2230,7,2230,8],[2231,7,2231,8],[2232,7,2232,8],[2233,7,2233,8],[2234,7,2234,8],[2235,7,2235,8],[2236,7,2236,8],[2237,7,2237,8],[2238,7,2238,8],[2239,7,2239,8],[2240,7,2240,8],[2241,7,2241,8],[2242,7,2242,8],[2243,7,2243,8],[2244,7,2244,8],[2245,7,2245,8],[2246,7,2246,8],[2247,7,2247,8],[2248,7,2248,8],[2249,7,2249,8],[2250,7,2250,8],[2251,7,2251,8],[2252,7,2252,8],[2253,7,2253,8],[2254,7,2254,8],[2255,7,2255,8],[2256,7,2256,8],[2257,7,2257,8],[2258,7,2258,8],[2259,7,2259,8],[2260,7,2260,8],[2261,7,2261,8],[2262,7,2262,8],[2263,7,2263,8],[2264,7,2264,8],[2265,7,2265,8],[2266,7,2266,8],[2267,7,2267,8],[2268,7,2268,8],[2269,7,2269,8],[2270,7,2270,8],[2271,7,2271,8],[2272,7,2272,8],[2273,7,2273,8],[2274,7,2274,8],[2275,7,2275,8],[2276,7,2276,8],[2277,7,2277,8],[2278,7,2278,8],[2279,7,2279,8],[2280,7,2280,8],[2281,7,2281,8],[2282,7,2282,8],[2283,7,2283,8],[2284,7,2284,8],[2285,7,2285,8],[2286,7,2286,8],[2287,7,2287,8],[2288,7,2288,8],[2289,7,2289,8],[2290,7,2290,8],[2291,7,2291,8],[2292,7,2292,8],[2293,7,2293,8],[2294,7,2294,8],[2295,7,2295,8],[2296,7,2296,8],[2297,7,2297,8],[2298,7,2298,8],[2299,7,2299,8],[2300,7,2300,8],[2301,7,2301,8],[2302,7,2302,8],[2303,7,2303,8],[2304,7,2304,8],[2305,7,2305,8],[2306,7,2306,8],[2307,7,2307,8],[2308,7,2308,8],[2309,7,2309,8],[2310,7,2310,8],[2311,7,2311,8],[2312,7,2312,8],[2313,7,2313,8],[2314,7,2314,8],[2315,7,2315,8],[2316,7,2316,8],[2317,7,2317,8],[2318,7,2318,8],[2319,7,2319,8],[2320,7,2320,8],[2321,7,2321,8],[2322,7,2322,8],[2323,7,2323,8],[2324,7,2324,8],[2325,7,2325,8],[2326,7,2326,8],[2327,7,2327,8],[2328,7,2328,8],[2329,7,2329,8],[2330,7,2330,8],[2331,7,2331,8],[2332,7,2332,8],[2333,7,2333,8],[2334,7,2334,8],[2335,7,2335,8],[2336,7,2336,8],[2337,7,2337,8],[2338,7,2338,8],[2339,7,2339,8],[2340,7,2340,8],[2341,7,2341,8],[2342,7,2342,8],[2343,7,2343,8],[2344,7,2344,8],[2345,7,2345,8],[2346,7,2346,8],[2347,7,2347,8],[2348,7,2348,8],[2349,7,2349,8],[2350,7,2350,8],[2351,7,2351,8],[2352,7,2352,8],[2353,7,2353,8],[2354,7,2354,8],[2355,7,2355,8],[2356,7,2356,8],[2357,7,2357,8],[2358,7,2358,8],[2359,7,2359,8],[2360,7,2360,8],[2361,7,2361,8],[2362,7,2362,8],[2363,7,2363,8],[2364,7,2364,8],[2365,7,2365,8],[2366,7,2366,8],[2367,7,2367,8],[2368,7,2368,8],[2369,7,2369,8],[2370,7,2370,8],[2371,7,2371,8],[2372,7,2372,8],[2373,7,2373,8],[2374,7,2374,8],[2375,7,2375,8],[2376,7,2376,8],[2377,7,2377,8],[2378,7,2378,8],[2379,7,2379,8],[2380,7,2380,8],[2381,7,2381,8],[2382,7,2382,8],[2383,7,2383,8],[2384,7,2384,8],[2385,7,2385,8],[2386,7,2386,8],[2387,7,2387,8],[2388,7,2388,8],[2389,7,2389,8],[2390,7,2390,8],[2391,7,2391,8],[2392,7,2392,8],[2393,7,2393,8],[2394,7,2394,8],[2395,7,2395,8],[2396,7,2396,8],[2397,7,2397,8],[2398,7,2398,8],[2399,7,2399,8],[2400,7,2400,8],[2401,7,2401,8],[2402,7,2402,8],[2403,7,2403,8],[2404,7,2404,8],[2405,7,2405,8],[2406,7,2406,8],[2407,7,2407,8],[2408,7,2408,8],[2409,7,2409,8],[2410,7,2410,8],[2411,7,2411,8],[2412,7,2412,8],[2413,7,2413,8],[2414,7,2414,8],[2415,7,2415,8],[2416,7,2416,8],[2417,7,2417,8],[2418,7,2418,8],[2419,7,2419,8],[2420,7,2420,8],[2421,7,2421,8],[2422,7,2422,8],[2423,7,2423,8],[2424,7,2424,8],[2425,7,2425,8],[2426,7,2426,8],[2427,7,2427,8],[2428,7,2428,8],[2429,7,2429,8],[2430,7,2430,8],[2431,7,2431,8],[2432,7,2432,8],[2433,7,2433,8],[2434,7,2434,8],[2435,7,2435,8],[2436,7,2436,8],[2437,7,2437,8],[2438,7,2438,8],[2439,7,2439,8],[2440,7,2440,8],[2441,7,2441,8],[2442,7,2442,8],[2443,7,2443,8],[2444,7,2444,8],[2445,7,2445,8],[2446,7,2446,8],[2447,7,2447,8],[2448,7,2448,8],[2449,7,2449,8],[2450,7,2450,8],[2451,7,2451,8],[2452,7,2452,8],[2453,7,2453,8],[2454,7,2454,8],[2455,7,2455,8],[2456,7,2456,8],[2457,7,2457,8],[2458,7,2458,8],[2459,7,2459,8],[2460,7,2460,8],[2461,7,2461,8],[2462,7,2462,8],[2463,7,2463,8],[2464,7,2464,8],[2465,7,2465,8],[2466,7,2466,8],[2467,7,2467,8],[2468,7,2468,8],[2469,7,2469,8],[2470,7,2470,8],[2471,7,2471,8],[2472,7,2472,8],[2473,7,2473,8],[2474,7,2474,8],[2475,7,2475,8],[2476,7,2476,8],[2477,7,2477,8],[2478,7,2478,8],[2479,7,2479,8],[2480,7,2480,8],[2481,7,2481,8],[2482,7,2482,8],[2483,7,2483,8],[2484,7,2484,8],[2485,7,2485,8],[2486,7,2486,8],[2487,7,2487,8],[2488,7,2488,8],[2489,7,2489,8],[2490,7,2490,8],[2491,7,2491,8],[2492,7,2492,8],[2493,7,2493,8],[2494,7,2494,8],[2495,7,2495,8],[2496,7,2496,8],[2497,7,2497,8],[2498,7,2498,8],[2499,7,2499,8],[2500,7,2500,8],[2501,7,2501,8],[2502,7,2502,8],[2503,7,2503,8],[2504,7,2504,8],[2505,7,2505,8],[2506,7,2506,8],[2507,7,2507,8],[2508,7,2508,8],[2509,7,2509,8],[2510,7,2510,8],[2511,7,2511,8],[2512,7,2512,8],[2513,7,2513,8],[2514,7,2514,8],[2515,7,2515,8],[2516,7,2516,8],[2517,7,2517,8],[2518,7,2518,8],[2519,7,2519,8],[2520,7,2520,8],[2521,7,2521,8],[2522,7,2522,8],[2523,7,2523,8],[2524,7,2524,8],[2525,7,2525,8],[2526,7,2526,8],[2527,7,2527,8],[2528,7,2528,8],[2529,7,2529,8],[2530,7,2530,8],[2531,7,2531,8],[2532,7,2532,8],[2533,7,2533,8],[2534,7,2534,8],[2535,7,2535,8],[2536,7,2536,8],[2537,7,2537,8],[2538,7,2538,8],[2539,7,2539,8],[2540,7,2540,8],[2541,7,2541,8],[2542,7,2542,8],[2543,7,2543,8],[2544,7,2544,8],[2545,7,2545,8],[2546,7,2546,8],[2547,7,2547,8],[2548,7,2548,8],[2549,7,2549,8],[2550,7,2550,8],[2551,7,2551,8],[2552,7,2552,8],[2553,7,2553,8],[2554,7,2554,8],[2555,7,2555,8],[2556,7,2556,8],[2557,7,2557,8],[2558,7,2558,8],[2559,7,2559,8],[2560,7,2560,8],[2561,7,2561,8],[2562,7,2562,8],[2563,7,2563,8],[2564,7,2564,8],[2565,7,2565,8],[2566,7,2566,8],[2567,7,2567,8],[2568,7,2568,8],[2569,7,2569,8],[2570,7,2570,8],[2571,7,2571,8],[2572,7,2572,8],[2573,7,2573,8],[2574,7,2574,8],[2575,7,2575,8],[2576,7,2576,8],[2577,7,2577,8],[2578,7,2578,8],[2579,7,2579,8],[2580,7,2580,8],[2581,7,2581,8],[2582,7,2582,8],[2583,7,2583,8],[2584,7,2584,8],[2585,7,2585,8],[2586,7,2586,8],[2587,7,2587,8],[2588,7,2588,8],[2589,7,2589,8],[2590,7,2590,8],[2591,7,2591,8],[2592,7,2592,8],[2593,7,2593,8],[2594,7,2594,8],[2595,7,2595,8],[2596,7,2596,8],[2597,7,2597,8],[2598,7,2598,8],[2599,7,2599,8],[2600,7,2600,8],[2601,7,2601,8],[2602,7,2602,8],[2603,7,2603,8],[2604,7,2604,8],[2605,7,2605,8],[2606,7,2606,8],[2607,7,2607,8],[2608,7,2608,8],[2609,7,2609,8],[2610,7,2610,8],[2611,7,2611,8],[2612,7,2612,8],[2613,7,2613,8],[2614,7,2614,8],[2615,7,2615,8],[2616,7,2616,8],[2617,7,2617,8],[2618,7,2618,8],[2619,7,2619,8],[2620,7,2620,8],[2621,7,2621,8],[2622,7,2622,8],[2623,7,2623,8],[2624,7,2624,8],[2625,7,2625,8],[2626,7,2626,8],[2627,7,2627,8],[2628,7,2628,8],[2629,7,2629,8],[2630,7,2630,8],[2631,7,2631,8],[2632,7,2632,8],[2633,7,2633,8],[2634,7,2634,8],[2635,7,2635,8],[2636,7,2636,8],[2637,7,2637,8],[2638,7,2638,8],[2639,7,2639,8],[2640,7,2640,8],[2641,7,2641,8],[2642,7,2642,8],[2643,7,2643,8],[2644,7,2644,8],[2645,7,2645,8],[2646,7,2646,8],[2647,7,2647,8],[2648,7,2648,8],[2649,7,2649,8],[2650,7,2650,8],[2651,7,2651,8],[2652,7,2652,8],[2653,7,2653,8],[2654,7,2654,8],[2655,7,2655,8],[2656,7,2656,8],[2657,7,2657,8],[2658,7,2658,8],[2659,7,2659,8],[2660,7,2660,8],[2661,7,2661,8],[2662,7,2662,8],[2663,7,2663,8],[2664,7,2664,8],[2665,7,2665,8],[2666,7,2666,8],[2667,7,2667,8],[2668,7,2668,8],[2669,7,2669,8],[2670,7,2670,8],[2671,7,2671,8],[2672,7,2672,8],[2673,7,2673,8],[2674,7,2674,8],[2675,7,2675,8],[2676,7,2676,8],[2677,7,2677,8],[2678,7,2678,8],[2679,7,2679,8],[2680,7,2680,8],[2681,7,2681,8],[2682,7,2682,8],[2683,7,2683,8],[2684,7,2684,8],[2685,7,2685,8],[2686,7,2686,8],[2687,7,2687,8],[2688,7,2688,8],[2689,7,2689,8],[2690,7,2690,8],[2691,7,2691,8],[2692,7,2692,8],[2693,7,2693,8],[2694,7,2694,8],[2695,7,2695,8],[2696,7,2696,8],[2697,7,2697,8],[2698,7,2698,8],[2699,7,2699,8],[2700,7,2700,8],[2701,7,2701,8],[2702,7,2702,8],[2703,7,2703,8],[2704,7,2704,8],[2705,7,2705,8],[2706,7,2706,8],[2707,7,2707,8],[2708,7,2708,8],[2709,7,2709,8],[2710,7,2710,8],[2711,7,2711,8],[2712,7,2712,8],[2713,7,2713,8],[2714,7,2714,8],[2715,7,2715,8],[2716,7,2716,8],[2717,7,2717,8],[2718,7,2718,8],[2719,7,2719,8],[2720,7,2720,8],[2721,7,2721,8],[2722,7,2722,8],[2723,7,2723,8],[2724,7,2724,8],[2725,7,2725,8],[2726,7,2726,8],[2727,7,2727,8],[2728,7,2728,8],[2729,7,2729,8],[2730,7,2730,8],[2731,7,2731,8],[2732,7,2732,8],[2733,7,2733,8],[2734,7,2734,8],[2735,7,2735,8],[2736,7,2736,8],[2737,7,2737,8],[2738,7,2738,8],[2739,7,2739,8],[2740,7,2740,8],[2741,7,2741,8],[2742,7,2742,8],[2743,7,2743,8],[2744,7,2744,8],[2745,7,2745,8],[2746,7,2746,8],[2747,7,2747,8],[2748,7,2748,8],[2749,7,2749,8],[2750,7,2750,8],[2751,7,2751,8],[2752,7,2752,8],[2753,7,2753,8],[2754,7,2754,8],[2755,7,2755,8],[2756,7,2756,8],[2757,7,2757,8],[2758,7,2758,8],[2759,7,2759,8],[2760,7,2760,8],[2761,7,2761,8],[2762,7,2762,8],[2763,7,2763,8],[2764,7,2764,8],[2765,7,2765,8],[2766,7,2766,8],[2767,7,2767,8],[2768,7,2768,8],[2769,7,2769,8],[2770,7,2770,8],[2771,7,2771,8],[2772,7,2772,8],[2773,7,2773,8],[2774,7,2774,8],[2775,7,2775,8],[2776,7,2776,8],[2777,7,2777,8],[2778,7,2778,8],[2779,7,2779,8],[2780,7,2780,8],[2781,7,2781,8],[2782,7,2782,8],[2783,7,2783,8],[2784,7,2784,8],[2785,7,2785,8],[2786,7,2786,8],[2787,7,2787,8],[2788,7,2788,8],[2789,7,2789,8],[2790,7,2790,8],[2791,7,2791,8],[2792,7,2792,8],[2793,7,2793,8],[2794,7,2794,8],[2795,7,2795,8],[2796,7,2796,8],[2797,7,2797,8],[2798,7,2798,8],[2799,7,2799,8],[2800,7,2800,8],[2801,7,2801,8],[2802,7,2802,8],[2803,7,2803,8],[2804,7,2804,8],[2805,7,2805,8],[2806,7,2806,8],[2807,7,2807,8],[2808,7,2808,8],[2809,7,2809,8],[2810,7,2810,8],[2811,7,2811,8],[2812,7,2812,8],[2813,7,2813,8],[2814,7,2814,8],[2815,7,2815,8],[2816,7,2816,8],[2817,7,2817,8],[2818,7,2818,8],[2819,7,2819,8],[2820,7,2820,8],[2821,7,2821,8],[2822,7,2822,8],[2823,7,2823,8],[2824,7,2824,8],[2825,7,2825,8],[2826,7,2826,8],[2827,7,2827,8],[2828,7,2828,8],[2829,7,2829,8],[2830,7,2830,8],[2831,7,2831,8],[2832,7,2832,8],[2833,7,2833,8],[2834,7,2834,8],[2835,7,2835,8],[2836,7,2836,8],[2837,7,2837,8],[2838,7,2838,8],[2839,7,2839,8],[2840,7,2840,8],[2841,7,2841,8],[2842,7,2842,8],[2843,7,2843,8],[2844,7,2844,8],[2845,7,2845,8],[2846,7,2846,8],[2847,7,2847,8],[2848,7,2848,8],[2849,7,2849,8],[2850,7,2850,8],[2851,7,2851,8],[2852,7,2852,8],[2853,7,2853,8],[2854,7,2854,8],[2855,7,2855,8],[2856,7,2856,8],[2857,7,2857,8],[2858,7,2858,8],[2859,7,2859,8],[2860,7,2860,8],[2861,7,2861,8],[2862,7,2862,8],[2863,7,2863,8],[2864,7,2864,8],[2865,7,2865,8],[2866,7,2866,8],[2867,7,2867,8],[2868,7,2868,8],[2869,7,2869,8],[2870,7,2870,8],[2871,7,2871,8],[2872,7,2872,8],[2873,7,2873,8],[2874,7,2874,8],[2875,7,2875,8],[2876,7,2876,8],[2877,7,2877,8],[2878,7,2878,8],[2879,7,2879,8],[2880,7,2880,8],[2881,7,2881,8],[2882,7,2882,8],[2883,7,2883,8],[2884,7,2884,8],[2885,7,2885,8],[2886,7,2886,8],[2887,7,2887,8],[2888,7,2888,8],[2889,7,2889,8],[2890,7,2890,8],[2891,7,2891,8],[2892,7,2892,8],[2893,7,2893,8],[2894,7,2894,8],[2895,7,2895,8],[2896,7,2896,8],[2897,7,2897,8],[2898,7,2898,8],[2899,7,2899,8],[2900,7,2900,8],[2901,7,2901,8],[2902,7,2902,8],[2903,7,2903,8],[2904,7,2904,8],[2905,7,2905,8],[2906,7,2906,8],[2907,7,2907,8],[2908,7,2908,8],[2909,7,2909,8],[2910,7,2910,8],[2911,7,2911,8],[2912,7,2912,8],[2913,7,2913,8],[2914,7,2914,8],[2915,7,2915,8],[2916,7,2916,8],[2917,7,2917,8],[2918,7,2918,8],[2919,7,2919,8],[2920,7,2920,8],[2921,7,2921,8],[2922,7,2922,8],[2923,7,2923,8],[2924,7,2924,8],[2925,7,2925,8],[2926,7,2926,8],[2927,7,2927,8],[2928,7,2928,8],[2929,7,2929,8],[2930,7,2930,8],[2931,7,2931,8],[2932,7,2932,8],[2933,7,2933,8],[2934,7,2934,8],[2935,7,2935,8],[2936,7,2936,8],[2937,7,2937,8],[2938,7,2938,8],[2939,7,2939,8],[2940,7,2940,8],[2941,7,2941,8],[2942,7,2942,8],[2943,7,2943,8],[2944,7,2944,8],[2945,7,2945,8],[2946,7,2946,8],[2947,7,2947,8],[2948,7,2948,8],[2949,7,2949,8],[2950,7,2950,8],[2951,7,2951,8],[2952,7,2952,8],[2953,7,2953,8],[2954,7,2954,8],[2955,7,2955,8],[2956,7,2956,8],[2957,7,2957,8],[2958,7,2958,8],[2959,7,2959,8],[2960,7,2960,8],[2961,7,2961,8],[2962,7,2962,8],[2963,7,2963,8],[2964,7,2964,8],[2965,7,2965,8],[2966,7,2966,8],[2967,7,2967,8],[2968,7,2968,8],[2969,7,2969,8],[2970,7,2970,8],[2971,7,2971,8],[2972,7,2972,8],[2973,7,2973,8],[2974,7,2974,8],[2975,7,2975,8],[2976,7,2976,8],[2977,7,2977,8],[2978,7,2978,8],[2979,7,2979,8],[2980,7,2980,8],[2981,7,2981,8],[2982,7,2982,8],[2983,7,2983,8],[2984,7,2984,8],[2985,7,2985,8],[2986,7,2986,8],[2987,7,2987,8],[2988,7,2988,8],[2989,7,2989,8],[2990,7,2990,8],[2991,7,2991,8],[2992,7,2992,8],[2993,7,2993,8],[2994,7,2994,8],[2995,7,2995,8],[2996,7,2996,8],[2997,7,2997,8],[2998,7,2998,8],[2999,7,2999,8],[3000,7,3000,8],[3001,7,3001,8],[3002,7,3002,8],[3003,7,3003,8],[3004,7,3004,8]],"merged_total":8990,"flags":["merged_cut"]}
[]
[null,"U.E. 313 UGEL CANAS"]
[null,{"$f":"IF(K2=\"JEC\",\"CUADRO DE HORAS JEC: ANEXO 07\",\"CUADRO DE HORAS JER-EIB: ANEXO 01\")","v":"CUADRO DE HORAS JER-EIB: ANEXO 01"}]
[]
[null,"INSTITUCION EDUCATIVA",null,"HIPOLITO TÚPAC AMARU",{"$nulls":4},"CÓDIGO MODULAR",null,"1201540",null,"INSTITUCION EDUCATIVA",null,"HIPOLITO TÚPAC AMARU"]
[null,"DISTRITO",null,"CHAUPIBANDA",{"$nulls":4},"GESTION",null,"Pública - Sector Educación",null,"DISTRITO",null,"CHAUPIBANDA"]
[null,"DIRECTOR (A)",null,"ADOLFO MAMANI CHALLCO",{"$nulls":4},"TELEFONO",null,943841166,null,"DIRECTOR (A)",null,"ADOLFO MAMANI CHALLCO"]
[]
[{"$nulls":13},"CASA PEREZ, FLAVIO HERNAN","29717796",null,"1",null,"40003 ALTO SELVA ALEGRE"]
[null,"VARIABLES PARA LA ELABORACION DEL CUADRO DE DISTRIBUCIÓN DE HORAS PEDAGÓGICAS DEL NIVEL SECUNDARIO E.B.R EIB DE FORTALECIMIENTO CULTURAL Y LINGÜÍSTICO"]
[]
[]
[null,"                                                  Grados                                  Variables",null,"1 °","2 °","3 °","4 °","5 °","Total",null,"Plan\nLectivo\nEstudios"]
[{"$nulls":8},{"$f":"SUM(D14:H14)","v":0}]
[null,"N° de Estudiantes",null,8,9,12,14,16,59,"Total Est."]
[null,"N° de Secciones",null,1,1,1,1,1,5,"Total Secciones",5]
[null,"N° de Horas de Clase",null,35,35,35,35,35,175,"Total de horas",175]
[null,"Carga Docente",null,2,2,2,2,2]
[]
[null,"CARGOS PRESUPUESTADOS EN LA INSTITUCIÓN EDUCATIVA / CENTRO",{"$nulls":11},"Las horas de clase deben ser igual a las horas de dictado (I17=K24)"]
[null,"N°","Cargo","Ley de Carrera a la que pertenece",null,"Área\n(Gest. Pedg. - Gest. Instit)",null,"Código Plaza Nexus",null,"Jornada\n Laboral","Horas de Dictado",null,"EXCE\nDENCIA","APELLIDOS Y NOMBRES COMPLETOS","DNI\n(Solo 8 Digitos)","ESPECIALIDAD - TITULO","ESCALA","TIEMPO DE SERVICIO","OBSERVACIONES\n(Condición Nombrado/Contratado, etc., /Colocar si el docente completa su jornada en otra IIEE)"]
[]
[]
[null,null,"Código Plaza Nexus",{"$nulls":4},"(12 Digitos)",null,null,169]
[null,1,"Prof. x Horas","Ley N° 29944",null,"Gest. Pedg.",null,426271219711,null,30,24,null,null,"VACANTE",null,"MATEMATICA"]
[null,2,"Prof. x Horas","Ley N° 29944",null,"Gest. Pedg.",null,426271219712,null,30,24,null,null,"VACANTE",null,"CIENCIAS SOCIALES"]
[null,3,"Prof. x Horas","Ley N° 29944",null,"Gest. Pedg.",null,426271219714,null,30,24,null,null,"VACANTE",null,"COMUNICACIÓN"]
[null,4,"Prof. x Horas","Ley N° 29944",null,"Gest. Pedg.",null,426271219715,null,30,25,null,null,"VACANTE",null,"COMUNICACIÓN"]
[null,5,"Prof. x Horas","Ley N° 29944",null,"Gest. Pedg.",null,426271219718,null,30,24,null,null,"VACANTE",null,"EDUCACION FISICA"]
[null,6,"Prof. x Horas","Ley N° 29944",null,"Gest. Pedg.",null,426271219719,null,30,24,null,null,"VACANTE",null,"CIENCIAS SOCIALES"]
[null,7,"Prof. x Horas","Ley N° 29944",null,"Gest. Pedg.",null,426291219717,null,30,24,null,null,"VACANTE",null,"CIENCIA Y TECNOLOGIA"]
[null,8]
[null,9]
[null,10]
[null,11]
[null,12]
[null,13]
[null,14]
[null,15]

{"sheet":"Hoja4","index":1,"n_rows":23,"n_cols":4,"rows_kept":23,"hidden":true}
["Código modular","Nombre de IE","Nivel / Modalidad","Secciones (Censo educativo 2017)"]
[{"v":236653,"d":"0236653"},"JOSE GABRIEL CONDORCANQUI","Secundaria",20]
[{"v":579391,"d":"0579391"},"FERNANDO TUPAC AMARU","Secundaria",8]
[{"v":579409,"d":"0579409"},"MICAELA BASTIDAS","Secundaria",5]
[{"v":579425,"d":"0579425"},"SEÑOR DE EXALTACION","Secundaria",10]
[{"v":791525,"d":"0791525"},"INDEPENDENCIA AMERICANA","Secundaria",15]
[{"v":931857,"d":"0931857"},"HAMPATURA","Secundaria",9]
[{"v":931881,"d":"0931881"},"DANIEL ESTRADA PEREZ MOSOCLLACTA","Secundaria",5]
[{"v":933317,"d":"0933317"},"SAN BARTOLOME","Secundaria",5]
[1201540,"HIPOLITO TUPAC AMARU","Secundaria",5]
[1201581,"LIBERTADOR TUPAC AMARU","Secundaria",5]
[1325059,56108,"Secundaria",5]
[1325067,56113,"Secundaria",5]
[1325075,56392,"Secundaria",5]
[1325083,56267,"Secundaria",5]
[1349471,56110,"Secundaria",5]
[1349489,56283,"Secundaria",5]
[1377183,"CPED - 56378","Secundaria",5]
[1390087,"RICARDO PALMA","Secundaria",5]
[1390095,"SAN JUAN BAUTISTA","Secundaria",5]
[1390111,"INCA TUPAC AMARU II","Secundaria",5]
[1390129,"FERNANDO BELAUNDE TERRI","Secundaria",5]
[1361070,"CEBA - JGC TUPAC AMARU II","Básica Alternativa - Avanzado",8]

{"sheet":"IMPRIMIR ANEXO 1","index":2,"n_rows":43,"n_cols":11,"rows_kept":43,"merged":[[0,3,0,8],[1,1,1,10],[3,1,3,2],[3,3,3,7],[3,8,3,9],[4,1,4,2],[4,3,4,7],[4,8,4,9],[5,1,5,2],[5,3,5,7],[5,8,5,9],[7,1,7,10],[8,1,9,10],[11,1,12,2],[11,3,12,3],[11,4,12,4],[11,5,12,5],[11,6,12,6],[11,7,12,7],[11,8,12,8],[11,10,13,10],[13,1,13,2],[14,1,14,2],[15,1,15,2],[16,1,16,2],[18,1,18,10],[19,1,22,1],[19,2,21,2],[19,3,22,4],[19,5,22,6],[19,7,21,8],[19,9,22,9],[19,10,21,10],[22,7,22,8],[23,3,23,4],[23,5,23,6],[23,7,23,8],[24,3,24,4],[24,5,24,6],[24,7,24,8],[25,3,25,4],[25,5,25,6],[25,7,25,8],[26,3,26,4],[26,5,26,6],[26,7,26,8],[27,3,27,4],[27,5,27,6],[27,7,27,8],[28,3,28,4],[28,5,28,6],[28,7,28,8],[29,3,29,4],[29,5,29,6],[29,7,29,8],[30,3,30,4],[30,5,30,6],[30,7,30,8],[31,3,31,4],[31,5,31,6],[31,7,31,8],[32,3,32,4],[32,5,32,6],[32,7,32,8],[33,1,33,6],[33,7,33,8],[35,1,35,10],[36,3,36,4],[36,5,36,6],[36,7,36,8],[37,3,37,4],[37,5,37,6],[37,7,37,8],[38,3,38,4],[38,5,38,6],[38,7,38,8],[39,3,39,4],[39,5,39,6],[39,7,39,8],[40,3,40,4],[40,5,40,6],[40,7,40,8],[41,3,41,4],[41,5,41,6],[41,7,41,8],[42,7,42,9]]}
[{"$nulls":3},"U.E. 313 UGEL CANAS"]
[null,{"$f":"IF(K1=\"JEC\",\"CUADRO DE HORAS JEC: ANEXO 07\",\"CUADRO DE HORAS JER-EIB: ANEXO 01\")","v":"CUADRO DE HORAS JER-EIB: ANEXO 01"}]
[]
[null,"INSTITUCION EDUCATIVA",null,"HIPOLITO TUPAC AMARU",{"$nulls":4},"CÓDIGO MODULAR",null,1325059]
[null,"DISTRITO",null,{"$f":"+anexo_01_07!D6","v":"CHAUPIBANDA"},{"$nulls":4},"GESTION",null,{"$f":"+anexo_01_07!K6","v":"Pública - Sector Educación"}]
[null,"DIRECTOR (A)",null,{"$f":"+anexo_01_07!D7","v":"ADOLFO MAMANI CHALLCO"},{"$nulls":4},"TELEFONO",null,943841166]
[]
[]
[null,"VARIABLES PARA LA ELABORACION DEL CUADRO DE DISTRIBUCIÓN DE HORAS PEDAGÓGICAS DEL NIVEL SECUNDARIO E.B.R - EIB DE FORTALECIMIENTO CULTURAL Y LINGÜÍSTICO"]
[]
[]
[null,"                                                  Grados                                  Variables",null,"1 °","2 °","3 °","4 °","5 °","Total",null,"Plan\nLectivo\nEstudios"]
[{"$nulls":8},{"$f":"SUM(D13:H13)","v":0}]
[null,"N° de Estudiantes",null,{"$f":"+anexo_01_07!D15","v":8},{"$f":"+anexo_01_07!E15","v":9},{"$f":"+anexo_01_07!F15","v":12},{"$f":"+anexo_01_07!G15","v":14},{"$f":"+anexo_01_07!H15","v":16},{"$f":"+anexo_01_07!I15","v":59},"Total Est."]
[null,"N° de Secciones",null,{"$f":"+anexo_01_07!D16","v":1},{"$f":"+anexo_01_07!E16","v":1},{"$f":"+anexo_01_07!F16","v":1},{"$f":"+anexo_01_07!G16","v":1},{"$f":"+anexo_01_07!H16","v":1},{"$f":"+anexo_01_07!I16","v":5},"Total Secciones",35]
[null,"N° de Horas de Clase",null,{"$f":"+anexo_01_07!D17","v":35},{"$f":"+anexo_01_07!E17","v":35},{"$f":"+anexo_01_07!F17","v":35},{"$f":"+anexo_01_07!G17","v":35},{"$f":"+anexo_01_07!H17","v":35},{"$f":"+anexo_01_07!I17","v":175},"Total de horas"]
[null,"Carga Docente",null,{"$f":"+anexo_01_07!D18","v":2},{"$f":"+anexo_01_07!E18","v":2},{"$f":"+anexo_01_07!F18","v":2},{"$f":"+anexo_01_07!G18","v":2},{"$f":"+anexo_01_07!H18","v":2}]
[]
[null,"CARGOS PRESUPUESTADOS EN LA INSTITUCIÓN EDUCATIVA / CENTRO"]
[null,"N°","Cargo","Ley de Carrera a la que pertenece",null,"Área\n(Gest. Pedg. - Gest. Instit)",null,"Código Plaza Nexus",null,"Jornada\n Laboral","Horas de Pedagógicas"]
[]
[]
[null,null,"Código Plaza Nexus",{"$nulls":4},"(12 Digitos)",null,null,0]
[null,1,"Prof. x Horas","Ley N° 29944",null,"Gest. Pedg.",null,426271219711,null,"30",24]
[null,2,"Prof. x Horas","Ley N° 29944",null,"Gest. Pedg.",null,426271219712,null,"30",24]
[null,3,"Prof. x Horas","Ley N° 29944",null,"Gest. Pedg.",null,426271219714,null,"30",24]
[null,4,"Prof. x Horas","Ley N° 29944",null,"Gest. Pedg.",null,426271219715,null,"30",25]
[null,5,"Prof. x Horas","Ley N° 29944",null,"Gest. Pedg.",null,426271219718,null,"30",24]
[null,6,"Prof. x Horas","Ley N° 29944",null,"Gest. Pedg.",null,426271219719,null,"30",24]
[null,7,"Prof. x Horas","Ley N° 29944",null,"Gest. Pedg.",null,426291219717,null,"30",24]
[null,8]
[null,9]
[null,10]
[null,"TOTAL PLAZAS",{"$nulls":5},{"$f":"COUNTA(H24:I33)","v":7},null,null,{"$f":"SUM(K24:K33)","v":169}]
[]
[null,"DISPONIBILIDAD PRESUPUESTAL PARA CONTRATOS EVENTUALES"]
[null,"N°","Cargo","Régimen de Contrato",null,"Área\n(Gest. Pedg. - Gest. Instit)",null,"Código Eventual",null,"Jornada\n Laboral","Horas Pedagógicas"]
[null,1,"Prof. x Horas","Bolsa de horas",null,"Gest. Pedg.",null,"Sin codigo",null,"06",6]
[]
[]
[]
[{"$nulls":7},{"$f":"COUNTA(H38:H41)","v":1},null,null,{"$f":"SUM(K38:K41)","v":6}]
[{"$nulls":7},"TOTAL HORAS",null,null,{"$f":"SUM(K34,K42)","v":175}]

{"sheet":"anexo_02_08","index":3,"n_rows":34,"n_cols":20,"rows_kept":34,"merged":[[1,1,1,19],[2,1,2,19],[4,2,4,12],[4,15,4,17],[4,18,4,19],[5,2,5,12],[5,15,5,17],[5,18,5,19],[6,2,6,12],[6,15,6,17],[6,18,6,19],[8,1,8,19],[10,1,11,1],[10,2,10,4],[10,5,10,7],[10,8,10,10],[10,11,10,13],[10,14,10,16],[10,17,10,19],[12,3,23,3],[12,6,23,6],[12,9,23,9],[12,12,23,12],[12,15,23,15],[12,18,23,18],[27,2,27,4],[27,5,27,7],[27,8,27,10],[27,11,27,13],[27,14,27,16],[28,1,32,1],[28,3,28,4],[28,6,28,7],[28,9,28,10],[28,12,28,13],[28,15,28,16],[29,3,29,4],[29,6,29,7],[29,9,29,10],[29,12,29,13],[29,15,29,16],[30,3,30,4],[30,6,30,7],[30,9,30,10],[30,12,30,13],[30,15,30,16],[31,3,31,4],[31,6,31,7],[31,9,31,10],[31,12,31,13],[31,15,31,16],[32,2,32,4],[32,5,32,7],[32,8,32,10],[32,11,32,13],[32,14,32,16]]}
[]
[null,{"$f":"anexo_01_07!B2","v":"U.E. 313 UGEL CANAS"}]
[null,{"$f":"IF(anexo_01_07!K2=\"JEC\",\"CUADRO DE HORAS JEC: ANEXO 08\",\"CUADRO DE HORAS JER-EIB: ANEXO 02\")","v":"CUADRO DE HORAS JER-EIB: ANEXO 02"}]
[]
[null,"INSTITUCIÓN EDUCATIVA","HIPOLITO TÚPAC AMARU",{"$nulls":12},"CODIGO MODULAR",null,null,"1201540"]
[null,"DISTRITO","CHAUPIBANDA",{"$nulls":12},"GESTION",null,null,"Pública - Sector Educación"]
[null,"DIRECTOR (A)","ADOLFO MAMANI CHALLCO",{"$nulls":12},"TELEFONO",null,null,943841166]
[]
[null,"DISTRIBUCION DE HORAS PEDAGÓGICAS POR GRADOS : SEGÚN PLAN DE ESTUDIOS EBR NIVEL SECUNDARIA EIB DE FORTALECIMIENTO CULTURAL Y LINGÜÍSTICO (JER)"]
[]
[null,"Area Curricular (*)","1°",null,null,"2°",null,null,"3°",null,null,"4°",null,null,"5°",null,null,"TOTALES PARCIALES"]
[null,null,"Horas Asig","N° Secc.","Total Horas","Horas Asig","N° Secc.","Total Horas","Horas Asig","N° Secc.","Total Horas","Horas Asig","N° Secc.","Total Horas","Horas Asig","N° Secc.","Total Horas","Horas Asig","N° Secc.","Total Horas"]
[null,"Matemática",4,1,4,4,1,4,4,1,4,4,1,4,4,1,4,20,5,20]
[null,"Comunicación en lengua originaria",3,null,3,3,null,3,3,null,3,3,null,3,3,null,3,15,null,15]
[null,"Castellano como segunda lengua",4,null,4,4,null,4,4,null,4,4,null,4,4,null,4,20,null,20]
[null,"Inglés",2,null,2,2,null,2,2,null,2,2,null,2,2,null,2,10,null,10]
[null,"Arte y Cultura",2,null,2,2,null,2,2,null,2,2,null,2,2,null,2,10,null,10]
[null,"Ciencias Sociales",3,null,3,3,null,3,3,null,3,3,null,3,3,null,3,15,null,15]
[null,"Desarrollo Personal, ciudadanía y cívica",3,null,3,3,null,3,3,null,3,3,null,3,3,null,3,15,null,15]
[null,"Educación Física",3,null,3,3,null,3,3,null,3,3,null,3,3,null,3,15,null,15]
[null,"Educación Religiosa",2,null,2,2,null,2,2,null,2,2,null,2,2,null,2,10,null,10]
[null,"Ciencia y Tecnología",4,null,4,4,null,4,4,null,4,4,null,4,4,null,4,20,null,20]
[null,"Educación para el Trabajo",3,null,3,3,null,3,3,null,3,3,null,3,3,null,3,15,null,15]
[null,"Tutoría y Orientación Educativa",2,null,2,2,null,2,2,null,2,2,null,2,2,null,2,10,null,10]
[null,"TOTAL:",35,1,35,35,1,35,35,1,35,35,1,35,35,1,35,175,5,175]
[{"$nulls":17},0,null,0]
[]
[]
[null,"JEC"]
[]
[]
[]
[]
[null,null,0,null,null,0,null,null,0,null,null,0,null,null,0]

{"sheet":"anexo_03_09","index":4,"n_rows":391,"n_cols":91,"rows_kept":391,"merged":[[0,2,1,4],[0,67,0,81],[0,83,0,118],[1,53,1,56],[1,67,12,67],[1,68,12,68],[1,69,12,69],[1,70,12,70],[1,71,12,71],[1,72,12,72],[1,73,12,73],[1,74,12,74],[1,75,12,75],[1,76,12,76],[1,77,12,77],[1,78,12,78],[1,79,12,79],[1,80,12,80],[1,81,12,81],[1,83,12,83],[1,84,12,84],[1,85,12,85],[1,86,12,86],[1,87,12,87],[1,88,12,88],[1,89,12,89],[1,90,12,90],[1,91,12,91],[1,92,12,92],[1,93,12,93],[1,94,12,94],[1,95,12,95],[1,96,12,96],[1,97,12,97],[1,98,12,98],[1,99,12,99],[1,100,12,100],[1,101,12,101],[1,102,12,102],[1,103,12,103],[1,104,12,104],[1,105,12,105],[1,106,12,106],[1,107,12,107],[1,108,12,108],[1,109,12,109],[1,110,12,110],[1,111,12,111],[1,112,12,112],[1,113,12,113],[1,114,12,114],[1,115,12,115],[1,116,12,116],[1,117,12,117],[1,118,12,118],[2,53,12,53],[2,54,12,54],[2,55,12,55],[2,56,12,56],[2,57,12,57],[2,58,12,58],[2,59,12,59],[10,1,12,1],[10,2,12,4],[10,50,12,50],[10,51,12,51],[10,52,12,52],[13,2,13,4],[14,1,22,1],[14,52,20,52],[14,53,22,53],[14,54,22,54],[14,55,22,55],[14,56,22,56],[14,57,22,57],[14,58,22,58],[14,59,22,59],[21,52,22,52],[22,2,22,4],[23,1,31,1],[23,52,29,52],[23,53,31,53],[23,54,31,54],[23,55,31,55],[23,56,31,56],[23,57,31,57],[23,58,31,58],[23,59,31,59],[30,52,31,52],[31,2,31,4],[32,1,40,1],[32,52,38,52],[32,53,40,53],[32,54,40,54],[32,55,40,55],[32,56,40,56],[32,57,40,57],[32,58,40,58],[32,59,40,59],[39,52,40,52],[40,2,40,4],[41,1,49,1],[41,52,47,52],[41,53,49,53],[41,54,49,54],[41,55,49,55],[41,56,49,56],[41,57,49,57],[41,58,49,58],[41,59,49,59],[48,52,49,52],[49,2,49,4],[50,1,58,1],[50,52,56,52],[50,53,58,53],[50,54,58,54],[50,55,58,55],[50,56,58,56],[50,57,58,57],[50,58,58,58],[50,59,58,59],[57,52,58,52],[58,2,58,4],[59,1,67,1],[59,52,65,52],[59,53,67,53],[59,54,67,54],[59,55,67,55],[59,56,67,56],[59,57,67,57],[59,58,67,58],[59,59,67,59],[66,52,67,52],[67,2,67,4],[68,1,76,1],[68,52,74,52],[68,53,76,53],[68,54,76,54],[68,55,76,55],[68,56,76,56],[68,57,76,57],[68,58,76,58],[68,59,76,59],[75,52,76,52],[76,2,76,4],[77,1,85,1],[77,52,83,52],[77,53,85,53],[77,54,85,54],[77,55,85,55],[77,56,85,56],[77,57,85,57],[77,58,85,58],[77,59,85,59],[84,52,85,52],[86,1,94,1],[86,52,92,52],[86,53,94,53],[86,54,94,54],[86,55,94,55],[86,56,94,56],[86,57,94,57],[86,58,94,58],[86,59,94,59],[93,52,94,52],[95,1,103,1],[95,52,101,52],[95,53,103,53],[95,54,103,54],[95,55,103,55],[95,56,103,56],[95,57,103,57],[95,58,103,58],[95,59,103,59],[102,52,103,52],[104,1,112,1],[104,52,110,52],[104,53,112,53],[104,54,112,54],[104,55,112,55],[104,56,112,56],[111,52,112,52],[113,1,121,1],[113,52,119,52],[113,53,121,53],[113,54,121,54],[113,55,121,55],[113,56,121,56],[120,52,121,52],[122,1,130,1],[122,52,128,52],[122,53,130,53],[122,54,130,54],[122,55,130,55],[122,56,130,56],[129,52,130,52],[131,1,139,1],[131,52,137,52],[131,53,139,53],[131,54,139,54],[131,55,139,55],[131,56,139,56],[138,52,139,52],[140,1,148,1],[140,52,146,52],[140,53,148,53],[140,54,148,54],[140,55,148,55],[140,56,148,56],[147,52,148,52],[149,1,157,1],[149,52,155,52],[149,53,157,53],[149,54,157,54],[149,55,157,55],[149,56,157,56],[156,52,157,52],[158,1,166,1],[158,52,164,52],[158,53,166,53],[158,54,166,54],[158,55,166,55],[158,56,166,56],[165,52,166,52],[167,1,175,1],[167,52,173,52],[167,53,175,53],[167,54,175,54],[167,55,175,55],[167,56,175,56],[174,52,175,52],[176,1,184,1],[176,52,182,52],[176,53,184,53],[176,54,184,54],[176,55,184,55],[176,56,184,56],[183,52,184,52],[185,1,193,1],[185,52,191,52],[185,53,193,53],[185,54,193,54],[185,55,193,55],[185,56,193,56],[192,52,193,52],[194,1,202,1],[194,52,200,52],[194,53,202,53],[194,54,202,54],[194,55,202,55],[194,56,202,56],[201,52,202,52],[203,1,211,1],[203,52,209,52],[203,53,211,53],[203,54,211,54],[203,55,211,55],[203,56,211,56],[210,52,211,52],[212,1,220,1],[212,52,218,52],[212,53,220,53],[212,54,220,54],[212,55,220,55],[212,56,220,56],[219,52,220,52],[221,1,229,1],[221,52,227,52],[221,53,229,53],[221,54,229,54],[221,55,229,55],[221,56,229,56],[228,52,229,52],[230,1,238,1],[230,52,236,52],[230,53,238,53],[230,54,238,54],[230,55,238,55],[230,56,238,56],[237,52,238,52],[239,1,247,1],[239,52,245,52],[239,53,247,53],[239,54,247,54],[239,55,247,55],[239,56,247,56],[246,52,247,52],[248,1,256,1],[248,52,254,52],[248,53,256,53],[248,54,256,54],[248,55,256,55],[248,56,256,56],[255,52,256,52],[257,1,265,1],[257,52,263,52],[257,53,265,53],[257,54,265,54],[257,55,265,55],[257,56,265,56],[264,52,265,52],[266,1,274,1],[266,52,272,52],[266,53,274,53],[266,54,274,54],[266,55,274,55],[266,56,274,56],[273,52,274,52],[275,1,283,1],[275,52,281,52],[275,53,283,53],[275,54,283,54],[275,55,283,55],[275,56,283,56],[282,52,283,52],[284,1,292,1],[284,52,290,52],[284,53,292,53],[284,54,292,54],[284,55,292,55],[284,56,292,56],[291,52,292,52],[293,1,301,1],[293,52,299,52],[293,53,301,53],[293,54,301,54],[293,55,301,55],[293,56,301,56],[300,52,301,52],[302,1,310,1],[302,52,308,52],[302,53,310,53],[302,54,310,54],[302,55,310,55],[302,56,310,56],[309,52,310,52],[311,1,319,1],[311,52,317,52],[311,53,319,53],[311,54,319,54],[311,55,319,55],[311,56,319,56],[318,52,319,52],[320,1,328,1],[320,52,326,52],[320,53,328,53],[320,54,328,54],[320,55,328,55],[320,56,328,56],[327,52,328,52],[329,1,337,1],[329,52,335,52],[329,53,337,53],[329,54,337,54],[329,55,337,55],[329,56,337,56],[336,52,337,52],[338,1,346,1],[338,52,344,52],[338,53,346,53],[338,54,346,54],[338,55,346,55],[338,56,346,56],[345,52,346,52],[347,1,355,1],[347,52,353,52],[347,53,355,53],[347,54,355,54],[347,55,355,55],[347,56,355,56],[354,52,355,52],[356,1,364,1],[356,52,362,52],[356,53,364,53],[356,54,364,54],[356,55,364,55],[356,56,364,56],[363,52,364,52],[365,1,373,1],[365,52,371,52],[365,53,373,53],[365,54,373,54],[365,55,373,55],[365,56,373,56],[372,52,373,52],[374,1,382,1],[374,52,380,52],[374,53,382,53],[374,54,382,54],[374,55,382,55],[374,56,382,56],[381,52,382,52],[383,1,391,1],[383,52,389,52],[383,53,391,53],[383,54,391,54],[383,55,391,55],[383,56,391,56],[390,52,391,52]]}
[null,null,{"$f":"anexo_01_07!B2","v":"U.E. 313 UGEL CANAS"},{"$nulls":64},"ÁREAS CURRICULARES"]
[{"$nulls":53},"TRABAJO COLEGIADO",{"$nulls":6},26,{"$nulls":6},"MATEMATICA","COMUNICACIÓN EN LENGUA ORIGINARIA","CASTELLANO COMO SEGUNDA LENGUA","INGLÉS","ARTE Y CULTURA","CIENCIAS SOCIALES","DESARROLLO PERSONAL, CIUDADANÍA Y CÍVICA","EDUCACIÓN FÍSICA","EDUCACIÓN RELIGIOSA","CIENCIA Y TECNOLOGÍA","EDUCACIÓN PARA EL TRABAJO","TUTORÍA Y ORIENTACIÓN EDUCATIVA",null,null,"TOTAL",null,{"$f":"BB3","v":"Refuerzo Escolar"},{"$f":"BC3","v":"Atención a Familias, trabajo colegiado, atencion al estudiante"},{"$f":"BD3","v":0},{"$f":"BE3","v":0},{"$nulls":3},"TOTAL"]
[{"$nulls":23},{"$f":"IF(anexo_01_07!K2=\"JEC\",\"CUADRO DE HORAS JEC: ANEXO 09\",\"CUADRO DE HORAS JER: ANEXO 03\")","v":"CUADRO DE HORAS JER: ANEXO 03"},{"$nulls":29},"Refuerzo Escolar","Atención a Familias, trabajo colegiado, atencion al estudiante"]
[]
[null,null,"NOMBRE IIEE","HIPOLITO TÚPAC AMARU",56108,{"$nulls":36},"CÓDIGO MODULAR",{"$nulls":10},"1201540"]
[null,null,"DISTRITO","CHAUPIBANDA",{"$nulls":37},"GESTION",{"$nulls":10},"Pública - Sector Educación"]
[null,null,"DIRECTOR(A)","ADOLFO MAMANI CHALLCO",{"$nulls":37},"TELEFONO",{"$nulls":10},943841166]
[{"$nulls":23},"CUADRO DE DISTRIBUCIÓN DE HORAS PEDAGÓGICAS DEL NIVEL SECUNDARIA"]
[{"$nulls":23},"EBR EIB DE FORTALECIMIENTO"]
[null,{"$f":"IF($AY14<>anexo_01_07!I17,\"La suma de las horas distribuidas por docente deben ser iguales al total asignado a la I.E.\",\"\")","v":""}]
[null,"N°","Id. Cargo",{"$nulls":20},"Grado de Estudios (Horas)",{"$nulls":26},"Total Horas","Especialidad","Jornada Pedagógica"]
[{"$nulls":5},"1 °","1 °","1 °","1 °","1 °","1 °","1 °","1 °","1 °","2 °","2 °","2 °","2 °","2 °","2 °","2 °","2 °","2 °","3 °","3 °","3 °","3 °","3 °","3 °","3 °","3 °","3 °","4 °","4 °","4 °","4 °","4 °","4 °","4 °","4 °","4 °","5 °","5 °","5 °","5 °","5 °","5 °","5 °","5 °","5 °"]
[{"$nulls":5},"A","B","C","D","E","F","G","H","I","A","B","C","D","E","F","G","H","I","A","B","C","D","E","F","G","H","I","A","B","C","D","E","F","G","H","I","A","B","C","D","E","F","G","H","I"]
[{"$nulls":5},35,0,0,0,0,0,0,0,0,35,0,0,0,0,0,0,0,0,35,0,0,0,0,0,0,0,0,35,0,0,0,0,0,0,0,0,35,0,0,0,0,0,0,0,0,175," JER= 175",{"$nulls":12},"INSTITUCION","CODPLAZA","APELLLIDOS Y NOMBRES","E104","E029","E089","E049","E181","E182","E119","E054","E048","E021","E055","E164","E022","E183"]
[null,"01","Código Plaza Nexus",null,"426271219711",4,{"$nulls":8},4,{"$nulls":8},4,{"$nulls":8},4,{"$nulls":8},4,{"$nulls":8},20,"MATEMÁTICA","24 Horas",5,1,{"$nulls":9},"HIPOLITO TÚPAC AMARU","426271219711","VACANTE",20,0,0,0,2,0,0,0,0,0,0,2,0,0,{"$f":"SUM(BP15:CC15)","v":24},null,5,1,0,0,{"$nulls":3},{"$f":"SUM(CD15:CI15)","v":30}]
[null,null,"Titular",null,"VACANTE",2,{"$nulls":44},2,"TUTORÍA Y ORIENTACIÓN EDUCATIVA"]
[null,null,"Cargo",null,"Prof. x Horas",2,{"$nulls":44},2,"ARTE Y CULTURA"]
[null,null,"Cod. Modular",null,"10",{"$nulls":45},0]
[null,null,"Espec. Título",null,"MATEMATICA",{"$nulls":45},0]
[null,null,"Escala Magisterial",{"$nulls":47},0]
[null,null,"Tiempo de Servicios",{"$nulls":47},0]
[null,null,"Obs: ",{"$nulls":47},0,null,"Total: 30 horas laboradas "]
[{"$nulls":50},0]
[null,"02","Código Plaza Nexus",null,"426271219712",3,{"$nulls":8},3,{"$nulls":8},3,{"$nulls":26},9,"DESARROLLO PERSONAL, CIUDADANÍA Y CÍVICA","24 Horas",5,1,{"$nulls":9},"HIPOLITO TÚPAC AMARU","426271219712","VACANTE",0,0,0,4,0,6,9,0,0,0,3,2,0,0,{"$f":"SUM(BP24:CC24)","v":24},null,5,1,0,0,{"$nulls":3},{"$f":"SUM(CD24:CJ24)","v":30}]
[null,null,"Titular",null,"VACANTE",{"$nulls":27},3,{"$nulls":8},3,{"$nulls":8},6,"CIENCIAS SOCIALES"]
[null,null,"Cargo",null,"Prof. x Horas",2,{"$nulls":8},2,{"$nulls":35},4,"INGLÉS"]
[null,null,"Cod. Modular",null,"10",{"$nulls":18},3,{"$nulls":26},3,"EDUCACIÓN PARA EL TRABAJO"]
[null,null,"Espec. Título",null,"CIENCIAS SOCIALES",{"$nulls":9},2,{"$nulls":35},2,"TUTORÍA Y ORIENTACIÓN EDUCATIVA"]
[null,null,"Escala Magisterial",{"$nulls":47},0]
[null,null,"Tiempo de Servicios",{"$nulls":47},0]
[null,null,"Obs: ",{"$nulls":47},0,null,"Total: 30 horas laboradas "]
[{"$nulls":50},0]
[null,"03","Código Plaza Nexus",null,"426271219714",4,{"$nulls":8},4,{"$nulls":8},4,{"$nulls":8},4,{"$nulls":8},4,{"$nulls":8},20,"CASTELLANO COMO SEGUNDA LENGUA","24 Horas",5,1,{"$nulls":9},"HIPOLITO TÚPAC AMARU","426271219714","VACANTE",0,0,20,2,0,0,0,0,0,0,0,2,0,0,{"$f":"SUM(BP33:CC33)","v":24},null,5,1,0,0,{"$nulls":3},{"$f":"SUM(CD33:CJ33)","v":30}]
[null,null,"Titular",null,"VACANTE",{"$nulls":18},2,{"$nulls":26},2,"TUTORÍA Y ORIENTACIÓN EDUCATIVA"]
[null,null,"Cargo",null,"Prof. x Horas",{"$nulls":18},2,{"$nulls":26},2,"INGLÉS"]
[null,null,"Cod. Modular",null,"10",{"$nulls":45},0]
[null,null,"Espec. Título",null,"COMUNICACIÓN",{"$nulls":45},0]
[null,null,"Escala Magisterial",{"$nulls":47},0]
[null,null,"Tiempo de Servicios",{"$nulls":47},0]
[null,null,"Obs: ",{"$nulls":47},0,null,"Total: 30 horas laboradas "]
[{"$nulls":50},0]
[null,"04","Código Plaza Nexus",null,"426271219715",3,{"$nulls":8},3,{"$nulls":8},3,{"$nulls":8},3,{"$nulls":8},3,{"$nulls":8},15,"COMUNICACIÓN EN LENGUA ORIGINARIA","25 Horas",null,5,{"$nulls":9},"HIPOLITO TÚPAC AMARU","426271219715","VACANTE",0,15,0,4,0,0,0,0,4,0,0,2,0,0,{"$f":"SUM(BP42:CC42)","v":25},null,0,5,0,0,{"$nulls":3},{"$f":"SUM(CD42:CJ42)","v":30}]
[null,null,"Titular",null,"VACANTE",{"$nulls":27},2,{"$nulls":17},2,"TUTORÍA Y ORIENTACIÓN EDUCATIVA"]
[null,null,"Cargo",null,"Prof. x Horas",{"$nulls":27},2,{"$nulls":8},2,{"$nulls":8},4,"INGLÉS"]
[null,null,"Cod. Modular",null,"10",2,{"$nulls":8},2,{"$nulls":35},4,"EDUCACIÓN RELIGIOSA"]
[null,null,"Espec. Título",null,"COMUNICACIÓN",{"$nulls":45},0]
[null,null,"Escala Magisterial",{"$nulls":47},0]
[null,null,"Tiempo de Servicios",{"$nulls":47},0]
[null,null,"Obs: ",{"$nulls":47},0,null,"Total: 30 horas laboradas "]
[{"$nulls":50},0]
[null,"05","Código Plaza Nexus",null,"426271219718",3,{"$nulls":8},3,{"$nulls":8},3,{"$nulls":8},3,{"$nulls":8},3,{"$nulls":8},15,"EDUCACIÓN FÍSICA","24 Horas",null,6,{"$nulls":9},"HIPOLITO TÚPAC AMARU","426271219718","VACANTE",0,0,0,0,6,0,0,15,0,0,3,0,0,0,{"$f":"SUM(BP51:CC51)","v":24},null,0,6,0,0,{"$nulls":3},{"$f":"SUM(CD51:CK51)","v":30}]
[null,null,"Titular",null,"VACANTE",{"$nulls":18},2,{"$nulls":8},2,{"$nulls":8},2,{"$nulls":8},6,"ARTE Y CULTURA"]
[null,null,"Cargo",null,"Prof. x Horas",{"$nulls":9},3,{"$nulls":35},3,"EDUCACIÓN PARA EL TRABAJO"]
[null,null,"Cod. Modular",null,"10",{"$nulls":45},0]
[null,null,"Espec. Título",null,"EDUCACION FISICA",{"$nulls":45},0]
[null,null,"Escala Magisterial",{"$nulls":47},0]
[null,null,"Tiempo de Servicios",{"$nulls":47},0]
[null,null,"Obs: ",{"$nulls":47},0,null,"Total: 30 horas laboradas "]
[{"$nulls":50},0]
[null,"06","Código Plaza Nexus",null,"426271219719",3,{"$nulls":8},3,{"$nulls":8},3,{"$nulls":26},9,"CIENCIAS SOCIALES","24 Horas",5,1,{"$nulls":9},"HIPOLITO TÚPAC AMARU","426271219719","VACANTE",0,0,0,0,0,9,6,0,0,0,9,0,0,0,{"$f":"SUM(BP60:CC60)","v":24},null,5,1,0,0,{"$nulls":3},{"$f":"SUM(CD60:CJ60)","v":30}]
[null,null,"Titular",null,"VACANTE",{"$nulls":27},3,{"$nulls":8},3,{"$nulls":8},6,"DESARROLLO PERSONAL, CIUDADANÍA Y CÍVICA"]
[null,null,"Cargo",null,"Prof. x Horas",3,{"$nulls":26},3,{"$nulls":8},3,{"$nulls":8},9,"EDUCACIÓN PARA EL TRABAJO"]
[null,null,"Cod. Modular",null,"10",{"$nulls":45},0]
[null,null,"Espec. Título",null,"CIENCIAS SOCIALES",{"$nulls":45},0]
[null,null,"Escala Magisterial",{"$nulls":47},0]
[null,null,"Tiempo de Servicios",{"$nulls":47},0]
[null,null,"Obs: ",{"$nulls":47},0,null,"Total: 30 horas laboradas "]
[{"$nulls":50},0]
[null,"07","Código Plaza Nexus",null,"426291219717",4,{"$nulls":8},4,{"$nulls":8},4,{"$nulls":8},4,{"$nulls":8},4,{"$nulls":8},20,"CIENCIA Y TECNOLOGÍA","24 Horas",5,1,{"$nulls":9},"HIPOLITO TÚPAC AMARU","426291219717","VACANTE",0,0,0,0,2,0,0,0,0,20,0,2,0,0,{"$f":"SUM(BP69:CC69)","v":24},null,5,1,0,0,{"$nulls":3},{"$f":"SUM(CD69:CK69)","v":30}]
[null,null,"Titular",null,"VACANTE",{"$nulls":36},2,{"$nulls":8},2,"TUTORÍA Y ORIENTACIÓN EDUCATIVA"]
[null,null,"Cargo",null,"Prof. x Horas",{"$nulls":9},2,{"$nulls":35},2,"ARTE Y CULTURA"]
[null,null,"Cod. Modular",null,"10",{"$nulls":45},0]
[null,null,"Espec. Título",null,"CIENCIA Y TECNOLOGIA",{"$nulls":45},0]
[null,null,"Escala Magisterial",{"$nulls":47},0]
[null,null,"Tiempo de Servicios",{"$nulls":47},0]
[null,null,"Obs: ",{"$nulls":47},0,null,"Total: 30 horas laboradas "]
[{"$nulls":50},0]
[null,"08","Código Plaza Nexus",null,"",{"$nulls":18},2,{"$nulls":8},2,{"$nulls":8},2,{"$nulls":8},6,"EDUCACIÓN RELIGIOSA","6 Horas",{"$nulls":11},"HIPOLITO TÚPAC AMARU","",null,0,0,0,0,0,0,0,0,6,0,0,0,0,0,{"$f":"SUM(BP78:CC78)","v":6},null,0,0,0,0,{"$nulls":3},{"$f":"SUM(CD78:CL78)","v":6}]
[null,null,"Titular",{"$nulls":47},0]
[null,null,"Cargo",{"$nulls":47},0]
[null,null,"Cod. Modular",null,"10",{"$nulls":45},0]
[null,null,"Espec. Título",{"$nulls":47},0]
[null,null,"Escala Magisterial",{"$nulls":47},0]
[null,null,"Tiempo de Servicios",{"$nulls":47},0]
[null,null,"Obs: ",null,"RELIGION",{"$nulls":45},0,null,"Total: 6 horas laboradas "]
[{"$nulls":50},0]
[null,"09","Código Plaza Nexus",null,"",{"$nulls":45},0,null,"0 Horas",{"$nulls":11},"HIPOLITO TÚPAC AMARU","",null,0,0,0,0,0,0,0,0,0,0,0,0,0,0,null,null,0,0,0,0]
[null,null,"Titular",{"$nulls":47},0]
[null,null,"Cargo",{"$nulls":47},0]
[null,null,"Cod. Modular",null,"10",{"$nulls":45},0]
[null,null,"Espec. Título",{"$nulls":47},0]
[null,null,"Escala Magisterial",{"$nulls":47},0]
[null,null,"Tiempo de Servicios",{"$nulls":47},0]
[null,null,"Obs: ",{"$nulls":47},0,null,"Total: 0 horas laboradas "]
[{"$nulls":50},0]
[null,"10","Código Plaza Nexus",null,"",{"$nulls":45},0,null,"0 Horas",{"$nulls":11},"HIPOLITO TÚPAC AMARU","",null,0,0,0,0,0,0,0,0,0,0,0,0,0,0,null,null,0,0,0,0]
[null,null,"Titular",{"$nulls":47},0]
[null,null,"Cargo",{"$nulls":47},0]
[null,null,"Cod. Modular",null,"10",{"$nulls":45},0]
[null,null,"Espec. Título",{"$nulls":47},0]
[null,null,"Escala Magisterial",{"$nulls":47},0]
[null,null,"Tiempo de Servicios",{"$nulls":47},0]
[null,null,"Obs: ",{"$nulls":47},0,null,"Total: 0 horas laboradas "]
[{"$nulls":50},0]
[null,11,"Código Plaza Nexus",null,"",{"$nulls":45},0,null,"0 Horas",{"$nulls":11},"HIPOLITO TÚPAC AMARU","",null,0,0,0,0,0,0,0,0,0,0,0,0,0,0,null,null,0,0,0,0]
[null,null,"Titular",{"$nulls":47},0]
[null,null,"Cargo",{"$nulls":47},0]
[null,null,"Cod. Modular",null,"10",{"$nulls":45},0]
[null,null,"Espec. Título",{"$nulls":47},0]
[null,null,"Escala Magisterial",{"$nulls":47},0]
[null,null,"Tiempo de Servicios",{"$nulls":47},0]
[null,null,"Obs: ",{"$nulls":47},0,null,"Total: 0 horas laboradas "]
[{"$nulls":50},0]
[null,12,"Código Plaza Nexus",null,"",{"$nulls":45},0,null,"0 Horas",{"$nulls":11},"HIPOLITO TÚPAC AMARU","",null,0,0,0,0,0,0,0,0,0,0,0,0,0,0,null,null,0,0,0,0]
[null,null,"Titular",{"$nulls":47},0]
[null,null,"Cargo",{"$nulls":47},0]
[null,null,"Cod. Modular",null,"10",{"$nulls":45},0]
[null,null,"Espec. Título",{"$nulls":47},0]
[null,null,"Escala Magisterial",{"$nulls":47},0]
[null,null,"Tiempo de Servicios",{"$nulls":47},0]
[null,null,"Obs: ",{"$nulls":47},0,null,"Total: 0 horas laboradas "]
[{"$nulls":50},0]
[null,13,"Código Plaza Nexus",null,"",{"$nulls":45},0,null,"0 Horas",{"$nulls":11},"HIPOLITO TÚPAC AMARU","",null,0,0,0,0,0,0,0,0,0,0,0,0,0,0,null,null,0,0,0,0]
[null,null,"Titular",{"$nulls":47},0]
[null,null,"Cargo",{"$nulls":47},0]
[null,null,"Cod. Modular",null,"10",{"$nulls":45},0]
[null,null,"Espec. Título",{"$nulls":47},0]
[null,null,"Escala Magisterial",{"$nulls":47},0]
[null,null,"Tiempo de Servicios",{"$nulls":47},0]
[null,null,"Obs: ",{"$nulls":47},0,null,"Total: 0 horas laboradas "]
[{"$nulls":50},0]
[null,14,"Código Plaza Nexus",null,"",{"$nulls":45},0,null,"0 Horas",{"$nulls":11},"HIPOLITO TÚPAC AMARU","",null,0,0,0,0,0,0,0,0,0,0,0,0,0,0,null,null,0,0,0,0]
[null,null,"Titular",{"$nulls":47},0]
[null,null,"Cargo",{"$nulls":47},0]
[null,null,"Cod. Modular",null,"10",{"$nulls":45},0]
[null,null,"Espec. Título",{"$nulls":47},0]
[null,null,"Escala Magisterial",{"$nulls":47},0]
[null,null,"Tiempo de Servicios",{"$nulls":47},0]
[null,null,"Obs: ",{"$nulls":47},0,null,"Total: 0 horas laboradas "]
[{"$nulls":50},0]
[null,15,"Código Plaza Nexus",null,"",{"$nulls":45},0,null,"0 Horas",{"$nulls":11},"HIPOLITO TÚPAC AMARU","",null,0,0,0,0,0,0,0,0,0,0,0,0,0,0,null,null,0,0,0,0]
[null,null,"Titular",{"$nulls":47},0]
[null,null,"Cargo",{"$nulls":47},0]
[null,null,"Cod. Modular",null,"10",{"$nulls":45},0]
[null,null,"Espec. Título",{"$nulls":47},0]
[null,null,"Escala Magisterial",{"$nulls":47},0]
[null,null,"Tiempo de Servicios",{"$nulls":47},0]
[null,null,"Obs: ",{"$nulls":47},0,null,"Total: 0 horas laboradas "]
[{"$nulls":50},0]
[null,16,"Código Plaza Nexus",null,"",{"$nulls":45},0,null,"0 Horas",{"$nulls":11},"HIPOLITO TÚPAC AMARU","",null,0,0,0,0,0,0,0,0,0,0,0,0,0,0,null,null,0,0,0,0]
[null,null,"Titular",{"$nulls":47},0]
[null,null,"Cargo",{"$nulls":47},0]
[null,null,"Cod. Modular",null,"10",{"$nulls":45},0]
[null,null,"Espec. Título",{"$nulls":47},0]
[null,null,"Escala Magisterial",{"$nulls":47},0]
[null,null,"Tiempo de Servicios",{"$nulls":47},0]
[null,null,"Obs: ",{"$nulls":47},0,null,"Total: 0 horas laboradas "]
[{"$nulls":50},0]
[null,17,"Código Plaza Nexus",null,"",{"$nulls":45},0,null,"0 Horas",{"$nulls":11},"HIPOLITO TÚPAC AMARU","",null,0,0,0,0,0,0,0,0,0,0,0,0,0,0,null,null,0,0,0,0]
[null,null,"Titular",{"$nulls":47},0]
[null,null,"Cargo",{"$nulls":47},0]
[null,null,"Cod. Modular",null,"10",{"$nulls":45},0]
[null,null,"Espec. Título",{"$nulls":47},0]
[null,null,"Escala Magisterial",{"$nulls":47},0]
[null,null,"Tiempo de Servicios",{"$nulls":47},0]
[null,null,"Obs: ",{"$nulls":47},0,null,"Total: 0 horas laboradas "]
[{"$nulls":50},0]
[null,18,"Código Plaza Nexus",null,"",{"$nulls":45},0,null,"0 Horas",{"$nulls":11},"HIPOLITO TÚPAC AMARU","",null,0,0,0,0,0,0,0,0,0,0,0,0,0,0,null,null,0,0,0,0]
[null,null,"Titular",{"$nulls":47},0]
[null,null,"Cargo",{"$nulls":47},0]
[null,null,"Cod. Modular",null,"10",{"$nulls":45},0]
[null,null,"Espec. Título",{"$nulls":47},0]
[null,null,"Escala Magisterial",{"$nulls":47},0]
[null,null,"Tiempo de Servicios",{"$nulls":47},0]
[null,null,"Obs: ",{"$nulls":47},0,null,"Total: 0 horas laboradas "]
[{"$nulls":50},0]
[null,19,"Código Plaza Nexus",null,"",{"$nulls":45},0,null,"0 Horas",{"$nulls":11},"HIPOLITO TÚPAC AMARU","",null,0,0,0,0,0,0,0,0,0,0,0,0,0,0,null,null,0,0,0,0]
[null,null,"Titular",{"$nulls":47},0]
[null,null,"Cargo",{"$nulls":47},0]
[null,null,"Cod. Modular",null,"10",{"$nulls":45},0]
[null,null,"Espec. Título",{"$nulls":47},0]
[null,null,"Escala Magisterial",{"$nulls":47},0]
[null,null,"Tiempo de Servicios",{"$nulls":47},0]
[null,null,"Obs: ",{"$nulls":47},0,null,"Total: 0 horas laboradas "]
[{"$nulls":50},0]
[null,20,"Código Plaza Nexus",null,"",{"$nulls":45},0,null,"0 Horas",{"$nulls":11},"HIPOLITO TÚPAC AMARU","",null,0,0,0,0,0,0,0,0,0,0,0,0,0,0,null,null,0,0,0,0]
[null,null,"Titular",{"$nulls":47},0]
[null,null,"Cargo",{"$nulls":47},0]
[null,null,"Cod. Modular",null,"10",{"$nulls":45},0]
[null,null,"Espec. Título",{"$nulls":47},0]
[null,null,"Escala Magisterial",{"$nulls":47},0]
[null,null,"Tiempo de Servicios",{"$nulls":47},0]
[null,null,"Obs: ",{"$nulls":47},0,null,"Total: 0 horas laboradas "]
[{"$nulls":50},0]
[null,21,"Código Plaza Nexus",null,"",{"$nulls":45},0,null,"0 Horas",{"$nulls":11},"HIPOLITO TÚPAC AMARU","",null,0,0,0,0,0,0,0,0,0,0,0,0,0,0,null,null,0,0,0,0]
[null,null,"Titular",{"$nulls":47},0]
[null,null,"Cargo",{"$nulls":47},0]
[null,null,"Cod. Modular",null,"10",{"$nulls":45},0]
[null,null,"Espec. Título",{"$nulls":47},0]
[null,null,"Escala Magisterial",{"$nulls":47},0]
[null,null,"Tiempo de Servicios",{"$nulls":47},0]
[null,null,"Obs: ",{"$nulls":47},0,null,"Total: 0 horas laboradas "]
[{"$nulls":50},0]
[null,22,"Código Plaza Nexus",null,"",{"$nulls":45},0,null,"0 Horas",{"$nulls":11},"HIPOLITO TÚPAC AMARU","",null,0,0,0,0,0,0,0,0,0,0,0,0,0,0,null,null,0,0,0,0]
[null,null,"Titular",{"$nulls":47},0]
[null,null,"Cargo",{"$nulls":47},0]
[null,null,"Cod. Modular",null,"10",{"$nulls":45},0]
[null,null,"Espec. Título",{"$nulls":47},0]
[null,null,"Escala Magisterial",{"$nulls":47},0]
[null,null,"Tiempo de Servicios",{"$nulls":47},0]
[null,null,"Obs: ",{"$nulls":47},0,null,"Total: 0 horas laboradas "]
[{"$nulls":50},0]
[null,23,"Código Plaza Nexus",null,"",{"$nulls":45},0,null,"0 Horas",{"$nulls":11},"HIPOLITO TÚPAC AMARU","",null,0,0,0,0,0,0,0,0,0,0,0,0,0,0,null,null,0,0,0,0]
[null,null,"Titular",{"$nulls":47},0]
[null,null,"Cargo",{"$nulls":47},0]
[null,null,"Cod. Modular",null,"10",{"$nulls":45},0]
[null,null,"Espec. Título",{"$nulls":47},0]
[null,null,"Escala Magisterial",{"$nulls":47},0]
[null,null,"Tiempo de Servicios",{"$nulls":47},0]
[null,null,"Obs: ",{"$nulls":47},0,null,"Total: 0 horas laboradas "]
[{"$nulls":50},0]
[null,24,"Código Plaza Nexus",null,"",{"$nulls":45},0,null,"0 Horas",{"$nulls":11},"HIPOLITO TÚPAC AMARU","",null,0,0,0,0,0,0,0,0,0,0,0,0,0,0,null,null,0,0,0,0]
[null,null,"Titular",{"$nulls":47},0]
[null,null,"Cargo",{"$nulls":47},0]
[null,null,"Cod. Modular",null,"10",{"$nulls":45},0]
[null,null,"Espec. Título",{"$nulls":47},0]
[null,null,"Escala Magisterial",{"$nulls":47},0]
[null,null,"Tiempo de Servicios",{"$nulls":47},0]
[null,null,"Obs: ",{"$nulls":47},0,null,"Total: 0 horas laboradas "]
[{"$nulls":50},0]
[null,25,"Código Plaza Nexus",null,"",{"$nulls":45},0,null,"0 Horas",{"$nulls":11},"HIPOLITO TÚPAC AMARU","",null,0,0,0,0,0,0,0,0,0,0,0,0,0,0,null,null,0,0,0,0]
[null,null,"Titular",{"$nulls":47},0]
[null,null,"Cargo",{"$nulls":47},0]
[null,null,"Cod. Modular",null,"10",{"$nulls":45},0]
[null,null,"Espec. Título",{"$nulls":47},0]
[null,null,"Escala Magisterial",{"$nulls":47},0]
[null,null,"Tiempo de Servicios",{"$nulls":47},0]
[null,null,"Obs: ",{"$nulls":47},0,null,"Total: 0 horas laboradas "]
[{"$nulls":50},0]
[null,26,"Código Plaza Nexus",null,"",{"$nulls":45},0,null,"0 Horas",{"$nulls":11},"HIPOLITO TÚPAC AMARU","",null,0,0,0,0,0,0,0,0,0,0,0,0,0,0,null,null,0,0,0,0]
[null,null,"Titular",{"$nulls":47},0]
[null,null,"Cargo",{"$nulls":47},0]
[null,null,"Cod. Modular",null,"10",{"$nulls":45},0]
[null,null,"Espec. Título",{"$nulls":47},0]
[null,null,"Escala Magisterial",{"$nulls":47},0]
[null,null,"Tiempo de Servicios",{"$nulls":47},0]
[null,null,"Obs: ",{"$nulls":47},0,null,"Total: 0 horas laboradas "]
[{"$nulls":50},0]
[null,27,"Código Plaza Nexus",null,"",{"$nulls":45},0,null,"0 Horas",{"$nulls":11},"HIPOLITO TÚPAC AMARU","",null,0,0,0,0,0,0,0,0,0,0,0,0,0,0,null,null,0,0,0,0]
[null,null,"Titular",{"$nulls":47},0]
[null,null,"Cargo",{"$nulls":47},0]
[null,null,"Cod. Modular",null,"10",{"$nulls":45},0]
[null,null,"Espec. Título",{"$nulls":47},0]
[null,null,"Escala Magisterial",{"$nulls":47},0]
[null,null,"Tiempo de Servicios",{"$nulls":47},0]
[null,null,"Obs: ",{"$nulls":47},0,null,"Total: 0 horas laboradas "]
[{"$nulls":50},0]
[null,28,"Código Plaza Nexus",null,"",{"$nulls":45},0,null,"0 Horas",{"$nulls":11},"HIPOLITO TÚPAC AMARU","",null,0,0,0,0,0,0,0,0,0,0,0,0,0,0,null,null,0,0,0,0]
[null,null,"Titular",{"$nulls":47},0]
[null,null,"Cargo",{"$nulls":47},0]
[null,null,"Cod. Modular",null,"10",{"$nulls":45},0]
[null,null,"Espec. Título",{"$nulls":47},0]
[null,null,"Escala Magisterial",{"$nulls":47},0]
[null,null,"Tiempo de Servicios",{"$nulls":47},0]
[null,null,"Obs: ",{"$nulls":47},0,null,"Total: 0 horas laboradas "]
[{"$nulls":50},0]
[null,29,"Código Plaza Nexus",null,"",{"$nulls":45},0,null,"0 Horas",{"$nulls":11},"HIPOLITO TÚPAC AMARU","",null,0,0,0,0,0,0,0,0,0,0,0,0,0,0,null,null,0,0,0,0]
[null,null,"Titular",{"$nulls":47},0]
[null,null,"Cargo",{"$nulls":47},0]
[null,null,"Cod. Modular",null,"10",{"$nulls":45},0]
[null,null,"Espec. Título",{"$nulls":47},0]
[null,null,"Escala Magisterial",{"$nulls":47},0]
[null,null,"Tiempo de Servicios",{"$nulls":47},0]
[null,null,"Obs: ",{"$nulls":47},0,null,"Total: 0 horas laboradas "]
[{"$nulls":50},0]
[null,30,"Código Plaza Nexus",null,"",{"$nulls":45},0,null,"0 Horas",{"$nulls":11},"HIPOLITO TÚPAC AMARU","",null,0,0,0,0,0,0,0,0,0,0,0,0,0,0,null,null,0,0,0,0]
[null,null,"Titular",{"$nulls":47},0]
[null,null,"Cargo",{"$nulls":47},0]
[null,null,"Cod. Modular",null,"10",{"$nulls":45},0]
[null,null,"Espec. Título",{"$nulls":47},0]
[null,null,"Escala Magisterial",{"$nulls":47},0]
[null,null,"Tiempo de Servicios",{"$nulls":47},0]
[null,null,"Obs: ",{"$nulls":47},0,null,"Total: 0 horas laboradas "]
[{"$nulls":50},0]
[null,31,"Código Plaza Nexus",null,"",{"$nulls":45},0,null,"0 Horas",{"$nulls":11},"HIPOLITO TÚPAC AMARU","",null,0,0,0,0,0,0,0,0,0,0,0,0,0,0,null,null,0,0,0,0]
[null,null,"Titular",{"$nulls":47},0]
[null,null,"Cargo",{"$nulls":47},0]
[null,null,"Cod. Modular",null,"10",{"$nulls":45},0]
[null,null,"Espec. Título",{"$nulls":47},0]
[null,null,"Escala Magisterial",{"$nulls":47},0]
[null,null,"Tiempo de Servicios",{"$nulls":47},0]
[null,null,"Obs: ",{"$nulls":47},0,null,"Total: 0 horas laboradas "]
[{"$nulls":50},0]
[null,32,"Código Plaza Nexus",null,"",{"$nulls":45},0,null,"0 Horas",{"$nulls":11},"HIPOLITO TÚPAC AMARU","",null,0,0,0,0,0,0,0,0,0,0,0,0,0,0,null,null,0,0,0,0]
[null,null,"Titular",{"$nulls":47},0]
[null,null,"Cargo",{"$nulls":47},0]
[null,null,"Cod. Modular",null,"10",{"$nulls":45},0]
[null,null,"Espec. Título",{"$nulls":47},0]
[null,null,"Escala Magisterial",{"$nulls":47},0]
[null,null,"Tiempo de Servicios",{"$nulls":47},0]
[null,null,"Obs: ",{"$nulls":47},0,null,"Total: 0 horas laboradas "]
[{"$nulls":50},0]
[null,33,"Código Plaza Nexus",null,"",{"$nulls":45},0,null,"0 Horas",{"$nulls":11},"HIPOLITO TÚPAC AMARU","",null,0,0,0,0,0,0,0,0,0,0,0,0,0,0,null,null,0,0,0,0]
[null,null,"Titular",{"$nulls":47},0]
[null,null,"Cargo",{"$nulls":47},0]
[null,null,"Cod. Modular",null,"10",{"$nulls":45},0]
[null,null,"Espec. Título",{"$nulls":47},0]
[null,null,"Escala Magisterial",{"$nulls":47},0]
[null,null,"Tiempo de Servicios",{"$nulls":47},0]
[null,null,"Obs: ",{"$nulls":47},0,null,"Total: 0 horas laboradas "]
[{"$nulls":50},0]
[null,34,"Código Plaza Nexus",null,"",{"$nulls":45},0,null,"0 Horas",{"$nulls":11},"HIPOLITO TÚPAC AMARU","",null,0,0,0,0,0,0,0,0,0,0,0,0,0,0,null,null,0,0,0,0]
[null,null,"Titular",{"$nulls":47},0]
[null,null,"Cargo",{"$nulls":47},0]
[null,null,"Cod. Modular",null,"10",{"$nulls":45},0]
[null,null,"Espec. Título",{"$nulls":47},0]
[null,null,"Escala Magisterial",{"$nulls":47},0]
[null,null,"Tiempo de Servicios",{"$nulls":47},0]
[null,null,"Obs: ",{"$nulls":47},0,null,"Total: 0 horas laboradas "]
[{"$nulls":50},0]
[null,35,"Código Plaza Nexus",null,"",{"$nulls":45},0,null,"0 Horas",{"$nulls":11},"HIPOLITO TÚPAC AMARU","",null,0,0,0,0,0,0,0,0,0,0,0,0,0,0,null,null,0,0,0,0]
[null,null,"Titular",{"$nulls":47},0]
[null,null,"Cargo",{"$nulls":47},0]
[null,null,"Cod. Modular",null,"10",{"$nulls":45},0]
[null,null,"Espec. Título",{"$nulls":47},0]
[null,null,"Escala Magisterial",{"$nulls":47},0]
[null,null,"Tiempo de Servicios",{"$nulls":47},0]
[null,null,"Obs: ",{"$nulls":47},0,null,"Total: 0 horas laboradas "]
[{"$nulls":50},0]
[null,36,"Código Plaza Nexus",null,"",{"$nulls":45},0,null,"0 Horas",{"$nulls":11},"HIPOLITO TÚPAC AMARU","",null,0,0,0,0,0,0,0,0,0,0,0,0,0,0,null,null,0,0,0,0]
[null,null,"Titular",{"$nulls":47},0]
[null,null,"Cargo",{"$nulls":47},0]
[null,null,"Cod. Modular",null,"10",{"$nulls":45},0]
[null,null,"Espec. Título",{"$nulls":47},0]
[null,null,"Escala Magisterial",{"$nulls":47},0]
[null,null,"Tiempo de Servicios",{"$nulls":47},0]
[null,null,"Obs: ",{"$nulls":47},0,null,"Total: 0 horas laboradas "]
[{"$nulls":50},0]
[null,37,"Código Plaza Nexus",null,"",{"$nulls":45},0,null,"0 Horas",{"$nulls":11},"HIPOLITO TÚPAC AMARU","",null,0,0,0,0,0,0,0,0,0,0,0,0,0,0,null,null,0,0,0,0]
[null,null,"Titular",{"$nulls":47},0]
[null,null,"Cargo",{"$nulls":47},0]
[null,null,"Cod. Modular",null,"10",{"$nulls":45},0]
[null,null,"Espec. Título",{"$nulls":47},0]
[null,null,"Escala Magisterial",{"$nulls":47},0]
[null,null,"Tiempo de Servicios",{"$nulls":47},0]
[null,null,"Obs: ",{"$nulls":47},0,null,"Total: 0 horas laboradas "]
[{"$nulls":50},0]
[null,38,"Código Plaza Nexus",null,"",{"$nulls":45},0,null,"0 Horas",{"$nulls":11},"HIPOLITO TÚPAC AMARU","",null,0,0,0,0,0,0,0,0,0,0,0,0,0,0,null,null,0,0,0,0]
[null,null,"Titular",{"$nulls":47},0]
[null,null,"Cargo",{"$nulls":47},0]
[null,null,"Cod. Modular",null,"10",{"$nulls":45},0]
[null,null,"Espec. Título",{"$nulls":47},0]
[null,null,"Escala Magisterial",{"$nulls":47},0]
[null,null,"Tiempo de Servicios",{"$nulls":47},0]
[null,null,"Obs: ",{"$nulls":47},0,null,"Total: 0 horas laboradas "]
[{"$nulls":50},0]
[null,39,"Código Plaza Nexus",null,"",{"$nulls":45},0,null,"0 Horas",{"$nulls":11},"HIPOLITO TÚPAC AMARU","",null,0,0,0,0,0,0,0,0,0,0,0,0,0,0,null,null,0,0,0,0]
[null,null,"Titular",{"$nulls":47},0]
[null,null,"Cargo",{"$nulls":47},0]
[null,null,"Cod. Modular",null,"10",{"$nulls":45},0]
[null,null,"Espec. Título",{"$nulls":47},0]
[null,null,"Escala Magisterial",{"$nulls":47},0]
[null,null,"Tiempo de Servicios",{"$nulls":47},0]
[null,null,"Obs: ",{"$nulls":47},0,null,"Total: 0 horas laboradas "]
[{"$nulls":50},0]
[null,40,"Código Plaza Nexus",null,"",{"$nulls":45},0,null,"0 Horas",{"$nulls":11},"HIPOLITO TÚPAC AMARU","",null,0,0,0,0,0,0,0,0,0,0,0,0,0,0,null,null,0,0,0,0]
[null,null,"Titular",{"$nulls":47},0]
[null,null,"Cargo",{"$nulls":47},0]
[null,null,"Cod. Modular",null,"10",{"$nulls":45},0]
[null,null,"Espec. Título",{"$nulls":47},0]
[null,null,"Escala Magisterial",{"$nulls":47},0]
[null,null,"Tiempo de Servicios",{"$nulls":47},0]
[null,null,"Obs: ",{"$nulls":47},0,null,"Total: 0 horas laboradas "]
[{"$nulls":50},0]
[null,41,"Código Plaza Nexus",null,""]
[null,null,"Titular"]
[null,null,"Cargo"]
[null,null,"Cod. Modular",null,"10"]
[null,null,"Espec. Título"]
[null,null,"Escala Magisterial"]
[null,null,"Tiempo de Servicios"]
[null,null,"Obs: "]
[]
[null,42,"Código Plaza Nexus",null,""]
[null,null,"Titular"]
[null,null,"Cargo"]
[null,null,"Cod. Modular",null,"10"]
[null,null,"Espec. Título"]
[null,null,"Escala Magisterial"]
[null,null,"Tiempo de Servicios"]
[null,null,"Obs: "]

{"sheet":"anexo_04_10","index":5,"n_rows":50,"n_cols":10,"rows_kept":50,"hidden":true,"merged":[[2,1,2,9],[3,1,3,9],[5,1,5,2],[5,3,5,6],[5,7,5,8],[6,1,6,2],[6,3,6,6],[6,7,6,8],[7,1,7,2],[7,3,7,6],[7,7,7,8],[9,1,10,9],[13,1,23,1],[13,2,23,2],[13,3,23,4],[13,5,23,6],[13,7,23,8],[13,9,23,9],[24,3,24,4],[24,5,24,6],[24,7,24,8],[25,3,25,4],[25,5,25,6],[25,7,25,8],[26,3,26,4],[26,5,26,6],[26,7,26,8],[27,3,27,4],[27,5,27,6],[27,7,27,8],[28,3,28,4],[28,5,28,6],[28,7,28,8],[29,3,29,4],[29,5,29,6],[29,7,29,8],[30,3,30,4],[30,5,30,6],[30,7,30,8],[31,3,31,4],[31,5,31,6],[31,7,31,8],[32,3,32,4],[32,5,32,6],[32,7,32,8],[33,3,33,4],[33,5,33,6],[33,7,33,8],[34,3,34,4],[34,5,34,6],[34,7,34,8],[35,3,35,4],[35,5,35,6],[35,7,35,8],[36,3,36,4],[36,5,36,6],[36,7,36,8],[37,3,37,4],[37,5,37,6],[37,7,37,8],[38,3,38,4],[38,5,38,6],[38,7,38,8],[39,3,39,4],[39,5,39,6],[39,7,39,8],[40,3,40,4],[40,5,40,6],[40,7,40,8],[41,3,41,4],[41,5,41,6],[41,7,41,8],[42,3,42,4],[42,5,42,6],[42,7,42,8],[43,3,43,4],[43,5,43,6],[43,7,43,8],[44,3,44,4],[44,5,44,6],[44,7,44,8],[45,3,45,4],[45,5,45,6],[45,7,45,8],[46,3,46,4],[46,5,46,6],[46,7,46,8],[47,3,47,4],[47,5,47,6],[47,7,47,8],[48,3,48,4],[48,5,48,6],[48,7,48,8]]}
[{"$f":"COUNTA(C25:C49)","v":0}]
[null,{"$f":"anexo_01_07!B2","v":"U.E. 313 UGEL CANAS"}]
[null,{"$f":"IF(anexo_01_07!K2=\"JEC\",\"CUADRO DE HORAS JEC: ANEXO 10\",\"CUADRO DE HORAS JER: ANEXO 04\")","v":"CUADRO DE HORAS JER: ANEXO 04"}]
[]
[]
[null,"INSTITUCION EDUCATIVA",null,"RICARDO PALMA",{"$nulls":3},"CÓDIGO MODULAR",null,"1390087"]
[null,"DISTRITO",null,"PONGOÑA",{"$nulls":3},"GESTION",null,"Pública - Sector Educación"]
[null,"DIRECTOR (A)",null,"QUISPICHO AMAT, BELTRAN",{"$nulls":3},"TELEFONO",null,940187160]
[]
[null,"CARGOS EXCEDENTES PRESUPUESTADOS EN LA INSTITUCIÓN EDUCATIVA"]
[]
[]
[]
[null,"N°","Cargo","Ley de Carrera a la \nque pertenece",null,"Área",null,"Código Plaza \nNexus",null,"Jornada\nLaboral"]
{"$rows_empty":10}
[null,1]
[null,2]
[null,3]
[null,4]
[null,5]
[null,6]
[null,7]
[null,8]
[null,9]
[null,10]
[null,11]
[null,12]
[null,13]
[null,14]
[null,15]
[null,16]
[null,17]
[null,18]
[null,19]
[null,20]
[null,21]
[null,22]
[null,23]
[null,24]
[null,25]
[null,{"$f":"\"TOTAL =  \" & COUNTA(C25:C49)","v":"TOTAL =  0"}]

{"sheet":"anexo_05_11","index":6,"n_rows":49,"n_cols":21,"rows_kept":49,"merged":[[2,1,2,9],[3,1,3,9],[5,1,5,2],[5,3,5,6],[5,7,5,8],[6,1,6,2],[6,3,6,6],[6,7,6,8],[7,1,7,2],[7,3,7,6],[7,7,7,8],[9,1,9,9],[12,1,12,9],[23,2,23,8],[24,2,24,4],[25,2,25,4],[26,2,26,4],[27,2,27,4],[28,2,28,4],[29,2,29,4],[30,2,30,4],[31,2,31,4],[32,2,32,4],[33,2,33,4],[34,2,34,4],[35,2,35,4],[36,2,36,6],[39,4,39,6],[39,7,39,9],[46,3,46,7],[47,3,47,7],[48,3,48,7]]}
[]
[null,{"$f":"anexo_01_07!B2","v":"U.E. 313 UGEL CANAS"},{"$nulls":17},"Proy RD","SI"]
[null,{"$f":"IF(anexo_01_07!K2=\"JEC\",\"CUADRO DE HORAS JEC: ANEXO 11\",\"CUADRO DE HORAS JER: ANEXO 05\")","v":"CUADRO DE HORAS JER: ANEXO 05"}]
[]
[]
[null,"INSTITUCION EDUCATIVA",null,"HIPOLITO TÚPAC AMARU",{"$nulls":3},"CÓDIGO MODULAR",null,"1201540"]
[null,"DISTRITO",null,"CHAUPIBANDA",{"$nulls":3},"GESTION",null,"Pública - Sector Educación"]
[null,"DIRECTOR (A)",null,"ADOLFO MAMANI CHALLCO",{"$nulls":3},"TELEFONO",null,943841166]
[]
[]
[]
[]
[null,"RESUMEN DEL CUADRO DE DISTRIBUCIÓN DE HORAS PEDAGÓGICAS - EIB FORTALECIMIENTO"]
[]
[]
[null,null,"Total Horas Pedagógicas",{"$nulls":4},169,"Horas"]
[null,null,"* Horas de Clase de Personal Directivo",{"$nulls":4},0,"Horas"]
[null,null,"* Horas de Clase de Personal Jerárquico",{"$nulls":4},0,"Horas"]
[null,null,"* Horas de Clase de Personal Coordinador",{"$nulls":4},0,"Horas"]
[null,null,"* Horas de Clase de Personal Docente",{"$nulls":4},169,"Horas"]
[null,null,"Horas de Clase de Personal Docente Bolsa de Horas",{"$nulls":4},6,"Horas"]
[]
[]
[null,null,"Resumen de Horas  Pedagógicas por Área - EIB"]
[null,null,"Matemática",{"$nulls":4},20,"Horas"]
[null,null,"Comunicación en lengua originaria",{"$nulls":4},15,"Horas"]
[null,null,"Castellano como segunda lengua",{"$nulls":4},20,"Horas"]
[null,null,"Inglés",{"$nulls":4},10,"Horas"]
[null,null,"Arte y Cultura",{"$nulls":4},10,"Horas"]
[null,null,"Ciencias Sociales",{"$nulls":4},15,"Horas"]
[null,null,"Desarrollo Personal, ciudadanía y cívica",{"$nulls":4},15,"Horas"]
[null,null,"Educación Física",{"$nulls":4},15,"Horas"]
[null,null,"Educación Religiosa",{"$nulls":4},10,"Horas"]
[null,null,"Ciencia y Tecnología",{"$nulls":4},20,"Horas"]
[null,null,"Educación para el Trabajo",{"$nulls":4},15,"Horas"]
[null,null,"Tutoría y Orientación Educativa",{"$nulls":4},10,"Horas"]
[null,null,"TOTAL GENERAL",{"$nulls":4},175,"Horas"]
[]
[]
[{"$nulls":7},"Yanaoca, diciembre de 2022"]
[]
[{"$nulls":4},"REGIÍSTRESE, COMUNÍQUESE"]
[]
[]
[]
[]
[{"$nulls":3},"DR.RUBEN JUSTO CENTENO CARRASCO"]
[{"$nulls":3},"DIRECTORA DEL PROGRAMA SECTORIAL III"]
[{"$nulls":3},"UNIDAD DE GESTIÓN EDUCATIVA LOCAL CANAS"]

{"sheet":"Hoja1","index":7,"n_rows":3,"n_cols":56,"rows_kept":3,"hidden":true,"merged":[[0,4,0,18],[0,20,0,55]]}
[{"$nulls":4},"AREAS CURRICULARES",{"$nulls":15},"HORAS ADICIONALES"]
[{"$nulls":4},"MATEMATICA","COMUNICACIÓN","INGLES","EDUCACION POR EL ARTE","HISTORIA GEOGRAFIA Y ECONOMIA","FORMACION CIUDADANA Y CIVICA","PERSONA FAMILIA Y RELACIONES HUMANAS","EDUCACION FISICA","EDUCACION RELIGIOSA","CIENCIA TECNOLOGIA Y AMBIENTE","EDUCACION PARA EL TRABAJO","TUTORIA Y ORIENTACION EDUCATIVA","CIENCIAS SOCIALES","CIENCIA, AMBIENTE Y SALUD","TOTAL",null,"MATEMATICA (Adicional)","COMUNICACIÓN (Adicional)","INGLES (Adicional)","EDUCACION POR EL ARTE (Adicional)","HISTORIA GEOGRAFIA Y ECONOMIA (Adicional)","FORMACION CIUDADANA Y CIVICA (Adicional)","PERSONA FAMILIA Y RELACIONES HUMANAS (Adicional)","EDUCACION FISICA (Adicional)","EDUCACION RELIGIOSA (Adicional)","CIENCIA TECNOLOGIA Y AMBIENTE (Adicional)","EDUCACION PARA EL TRABAJO (Adicional)","TUTORIA Y ORIENTACION EDUCATIVA (Adicional)","CIENCIAS SOCIALES (Adicional)","CIENCIA, AMBIENTE Y SALUD (Adicional)","MATEMATICA - JEC","COMUNICACIÓN - JEC","INGLES - JEC","EDUCACION POR EL ARTE - JEC","HISTORIA GEOGRAFIA Y ECONOMIA - JEC","FORMACION CIUDADANA Y CIVICA - JEC","PERSONA FAMILIA Y RELACIONES HUMANAS - JEC","EDUCACION FISICA - JEC","EDUCACION RELIGIOSA - JEC","CIENCIA TECNOLOGIA Y AMBIENTE - JEC","EDUCACION PARA EL TRABAJO - JEC","TUTORIA Y ORIENTACION EDUCATIVA - JEC","HORAS DE LIBRE DISPONIBILIDAD - JEC","ATENCION A PADRES DE FAMILIA","ELABORACION DE MATERIALES Y REVISION DE LOGROS DE ESTUDIANTES","REUNIONES DE TRABAJO COLEGIADO","TUTORIA - CRFA","REVISION Y CORRECUCION DEL PLAN DE INVESTIGACION - CRFA","TRABAJO DE ORIENTACION CON LA FAMILIA - CRFA","REVISION DE PROYECTOS - CRFA","VISITA EN ALTERNANCIA PROFESIONAL - CRFA","TOTAL"]
["NIVEL","INSTITUCION","CODPLAZA","APELLLIDOS Y NOMBRES","E104","E029","E089","E049","E181","E182","E119","E054","E048","E021","E055","E164","E022","E183",null,null,"E104","E029","E089","E049","E181","E182","E119","E054","E048","E021","E055","E164","E022","E183","J001","J002","J003","J004","J005","J006","J007","J008","J009","J010","J011","J012","J013","J014","J015","J016","CR01","CR02","CR03","CR04","CR05"]

{"sheet":"nexus","index":8,"n_rows":98,"n_cols":25,"rows_kept":98,"hidden":true}
[]
[{"$nulls":4},"MATEMÁTICA","COMUNICACIÓN EN LENGUA ORIGINARIA","CASTELLANO COMO SEGUNDA LENGUA","INGLÉS","ARTE Y CULTURA","CIENCIAS SOCIALES","DESARROLLO PERSONAL, CIUDADANÍA Y CÍVICA","EDUCACIÓN FÍSICA","EDUCACIÓN RELIGIOSA","CIENCIA Y TECNOLOGÍA","EDUCACIÓN PARA EL TRABAJO","TUTORÍA Y ORIENTACIÓN EDUCATIVA",null,null,"TOTAL",{"$f":"anexo_03_09!CE2","v":0},"Trabajo Colegiado","Atención a Familias","Atención al Estudiante",0,"TOTAL"]
["NIVEL","INSTITUCION","CODPLAZA","APELLIDOS Y NOMBRES","E104","E029","E089","E049","E181","E182","E119","E054","E048","E021","E055","E164","E022","E183"]
["SECUNDARIA",null,"",null,20,0,0,0,0,0,0,0,0,0,0,0,0,0,null,null,1,2,3,0]
["SECUNDARIA",null,"",null,0,0,0,0,0,0,0,0,0,0,0,10,0,0,null,null,2,1,3,0]
["SECUNDARIA",null,"",null,0,0,0,0,0,0,0,0,0,0,0,0,0,0,null,null,2,1,3,0]
["SECUNDARIA",null,"",null,0,0,0,0,0,0,0,0,0,0,0,0,0,0,null,null,2,1,3,0]
["SECUNDARIA",null,"",null,0,0,0,0,0,0,0,0,0,0,0,0,0,0,null,null,2,1,3,0]
["SECUNDARIA",null,"",null,0,0,0,0,0,0,0,0,0,0,0,0,0,0,null,null,2,1,3,0]
["SECUNDARIA",null,"",null,0,0,0,0,0,0,0,0,0,0,0,0,0,0,null,null,2,1,3,0]
["SECUNDARIA",null,"",null,0,0,0,0,0,0,0,0,0,0,0,0,0,0,null,null,0,0,0,0]
["SECUNDARIA",null,"",null,0,0,0,0,0,0,0,0,0,0,0,0,0,0,null,null,0,0,0,0]
["SECUNDARIA",null,"",null,0,0,0,0,0,0,0,0,0,0,0,0,0,0,null,null,0,0,0,0]
["SECUNDARIA",null,"",null,0,0,0,0,0,0,0,0,0,0,0,0,0,0,null,null,0,0,0,0]
["SECUNDARIA",null,"",null,0,0,0,0,0,0,0,0,0,0,0,0,0,0,null,null,0,0,0,0]
["SECUNDARIA",null,"",null,0,0,0,0,0,0,0,0,0,0,0,0,0,0,null,null,0,0,0,0]
["SECUNDARIA",null,"",null,0,0,0,0,0,0,0,0,0,0,0,0,0,0,null,null,0,0,0,0]
["SECUNDARIA",null,"",null,0,0,0,0,0,0,0,0,0,0,0,0,0,0,null,null,0,0,0,0]
["SECUNDARIA",null,"",null,0,0,0,0,0,0,0,0,0,0,0,0,0,0,null,null,0,0,0,0]
["SECUNDARIA",null,"",null,0,0,0,0,0,0,0,0,0,0,0,0,0,0,null,null,0,0,0,0]
["SECUNDARIA",null,"",null,0,0,0,0,0,0,0,0,0,0,0,0,0,0,null,null,0,0,0,0]
["SECUNDARIA",null,"",null,0,0,0,0,0,0,0,0,0,0,0,0,0,0,null,null,0,0,0,0]
["SECUNDARIA",null,"",null,0,0,0,0,0,0,0,0,0,0,0,0,0,0,null,null,0,0,0,0]
["SECUNDARIA",null,"",null,0,0,0,0,0,0,0,0,0,0,0,0,0,0,null,null,0,0,0,0]
["SECUNDARIA",null,"",null,0,0,0,0,0,0,0,0,0,0,0,0,0,0,null,null,0,0,0,0]
["SECUNDARIA",null,"",null,0,0,0,0,0,0,0,0,0,0,0,0,0,0,null,null,0,0,0,0]
["SECUNDARIA",null,"",null,0,0,0,0,0,0,0,0,0,0,0,0,0,0,null,null,0,0,0,0]
["SECUNDARIA",null,"",null,0,0,0,0,0,0,0,0,0,0,0,0,0,0,null,null,0,0,0,0]
["SECUNDARIA",null,"",null,0,0,0,0,0,0,0,0,0,0,0,0,0,0,null,null,0,0,0,0]
["SECUNDARIA",null,"",null,0,0,0,0,0,0,0,0,0,0,0,0,0,0,null,null,0,0,0,0]
["SECUNDARIA",null,"",null,0,0,0,0,0,0,0,0,0,0,0,0,0,0,null,null,0,0,0,0]
["SECUNDARIA",null,"",null,0,0,0,0,0,0,0,0,0,0,0,0,0,0,null,null,0,0,0,0]
["SECUNDARIA",null,"",null,0,0,0,0,0,0,0,0,0,0,0,0,0,0,null,null,0,0,0,0]
["SECUNDARIA",null,"",null,0,0,0,0,0,0,0,0,0,0,0,0,0,0,null,null,0,0,0,0]
["SECUNDARIA",null,"",null,0,0,0,0,0,0,0,0,0,0,0,0,0,0,null,null,0,0,0,0]
["SECUNDARIA",null,"",null,0,0,0,0,0,0,0,0,0,0,0,0,0,0,null,null,0,0,0,0]
["SECUNDARIA",null,"",null,0,0,0,0,0,0,0,0,0,0,0,0,0,0,null,null,0,0,0,0]
["SECUNDARIA",null,"",null,0,0,0,0,0,0,0,0,0,0,0,0,0,0,null,null,0,0,0,0]
["SECUNDARIA",null,"",null,0,0,0,0,0,0,0,0,0,0,0,0,0,0,null,null,0,0,0,0]
["SECUNDARIA",null,"",null,0,0,0,0,0,0,0,0,0,0,0,0,0,0,null,null,0,0,0,0]
["SECUNDARIA",null,"",null,0,0,0,0,0,0,0,0,0,0,0,0,0,0,null,null,0,0,0,0]
["SECUNDARIA",null,"",null,0,0,0,0,0,0,0,0,0,0,0,0,0,0,null,null,0,0,0,0]
["SECUNDARIA",null,"",null,0,0,0,0,0,0,0,0,0,0,0,0,0,0,null,null,0,0,0,0]
["SECUNDARIA","HIPOLITO TUPAC AMARU","",null,0,0,0,0,0,0,0,0,0,0,0,0,0,0,0,null,0,0,0,0]
["SECUNDARIA","HIPOLITO TUPAC AMARU","",null,0,0,0,0,0,0,0,0,0,0,0,0,0,0,0,null,0,0,0,0]
["SECUNDARIA","HIPOLITO TUPAC AMARU","",null,0,0,0,0,0,0,0,0,0,0,0,0,0,0,0,null,0,0,0,0]
["SECUNDARIA","HIPOLITO TUPAC AMARU","",null,0,0,0,0,0,0,0,0,0,0,0,0,0,0,0,null,0,0,0,0]
["SECUNDARIA","HIPOLITO TUPAC AMARU","",null,0,0,0,0,0,0,0,0,0,0,0,0,0,0,0,null,0,0,0,0]
["SECUNDARIA","HIPOLITO TUPAC AMARU","",null,0,0,0,0,0,0,0,0,0,0,0,0,0,0,0,null,0,0,0,0]
["SECUNDARIA","HIPOLITO TUPAC AMARU","",null,0,0,0,0,0,0,0,0,0,0,0,0,0,0,0,null,0,0,0,0]
["SECUNDARIA","HIPOLITO TUPAC AMARU","",null,0,0,0,0,0,0,0,0,0,0,0,0,0,0,0,null,0,0,0,0]
["SECUNDARIA","HIPOLITO TUPAC AMARU","",null,0,0,0,0,0,0,0,0,0,0,0,0,0,0,0,null,0,0,0,0]
["SECUNDARIA","HIPOLITO TUPAC AMARU","",null,0,0,0,0,0,0,0,0,0,0,0,0,0,0,0,null,0,0,0,0]
["SECUNDARIA","HIPOLITO TUPAC AMARU","",null,0,0,0,0,0,0,0,0,0,0,0,0,0,0,0,null,0,0,0,0]
["SECUNDARIA","HIPOLITO TUPAC AMARU","",null,0,0,0,0,0,0,0,0,0,0,0,0,0,0,0,null,0,0,0,0]
["SECUNDARIA","HIPOLITO TUPAC AMARU","",null,0,0,0,0,0,0,0,0,0,0,0,0,0,0,0,null,0,0,0,0]
["SECUNDARIA","HIPOLITO TUPAC AMARU","",null,0,0,0,0,0,0,0,0,0,0,0,0,0,0,0,null,0,0,0,0]
["SECUNDARIA","HIPOLITO TUPAC AMARU","",null,0,0,0,0,0,0,0,0,0,0,0,0,0,0,0,null,0,0,0,0]
["SECUNDARIA","HIPOLITO TUPAC AMARU","",null,0,0,0,0,0,0,0,0,0,0,0,0,0,0,0,null,0,0,0,0]
["SECUNDARIA","HIPOLITO TUPAC AMARU","",null,0,0,0,0,0,0,0,0,0,0,0,0,0,0,0,null,0,0,0,0]
["SECUNDARIA","HIPOLITO TUPAC AMARU","",null,0,0,0,0,0,0,0,0,0,0,0,0,0,0,0,null,0,0,0,0]
["SECUNDARIA","HIPOLITO TUPAC AMARU","",null,0,0,0,0,0,0,0,0,0,0,0,0,0,0,0,null,0,0,0,0]
["SECUNDARIA","HIPOLITO TUPAC AMARU","",null,0,0,0,0,0,0,0,0,0,0,0,0,0,0,0,null,0,0,0,0]
["SECUNDARIA","HIPOLITO TUPAC AMARU","",null,0,0,0,0,0,0,0,0,0,0,0,0,0,0,0,null,0,0,0,0]
["SECUNDARIA","HIPOLITO TUPAC AMARU","",null,0,0,0,0,0,0,0,0,0,0,0,0,0,0,0,null,0,0,0,0]
["SECUNDARIA","HIPOLITO TUPAC AMARU","",null,0,0,0,0,0,0,0,0,0,0,0,0,0,0,0,null,0,0,0,0]
["SECUNDARIA","HIPOLITO TUPAC AMARU","",null,0,0,0,0,0,0,0,0,0,0,0,0,0,0,0,null,0,0,0,0]
["SECUNDARIA","HIPOLITO TUPAC AMARU","",null,0,0,0,0,0,0,0,0,0,0,0,0,0,0,0,null,0,0,0,0]
["SECUNDARIA","HIPOLITO TUPAC AMARU","",null,0,0,0,0,0,0,0,0,0,0,0,0,0,0,0,null,0,0,0,0]
["SECUNDARIA","HIPOLITO TUPAC AMARU","",null,0,0,0,0,0,0,0,0,0,0,0,0,0,0,0,null,0,0,0,0]
["SECUNDARIA","HIPOLITO TUPAC AMARU","",null,0,0,0,0,0,0,0,0,0,0,0,0,0,0,0,null,0,0,0,0]
["SECUNDARIA","HIPOLITO TUPAC AMARU","",null,0,0,0,0,0,0,0,0,0,0,0,0,0,0,0,null,0,0,0,0]
["SECUNDARIA","HIPOLITO TUPAC AMARU","",null,0,0,0,0,0,0,0,0,0,0,0,0,0,0,0,null,0,0,0,0]
["SECUNDARIA","HIPOLITO TUPAC AMARU","",null,0,0,0,0,0,0,0,0,0,0,0,0,0,0,0,null,0,0,0,0]
["SECUNDARIA","HIPOLITO TUPAC AMARU","",null,0,0,0,0,0,0,0,0,0,0,0,0,0,0,0,null,0,0,0,0]
["SECUNDARIA","HIPOLITO TUPAC AMARU","",null,0,0,0,0,0,0,0,0,0,0,0,0,0,0,0,null,0,0,0,0]
["SECUNDARIA","HIPOLITO TUPAC AMARU","",null,0,0,0,0,0,0,0,0,0,0,0,0,0,0,0,null,0,0,0,0]
["SECUNDARIA","HIPOLITO TUPAC AMARU","",null,0,0,0,0,0,0,0,0,0,0,0,0,0,0,0,null,0,0,0,0]
["SECUNDARIA","HIPOLITO TUPAC AMARU","",null,0,0,0,0,0,0,0,0,0,0,0,0,0,0,0,null,0,0,0,0]
["SECUNDARIA","HIPOLITO TUPAC AMARU","",null,0,0,0,0,0,0,0,0,0,0,0,0,0,0,0,null,0,0,0,0]
["SECUNDARIA","HIPOLITO TUPAC AMARU","",null,0,0,0,0,0,0,0,0,0,0,0,0,0,0,0,null,0,0,0,0]
["SECUNDARIA","HIPOLITO TUPAC AMARU","",null,0,0,0,0,0,0,0,0,0,0,0,0,0,0,0,null,0,0,0,0]
["SECUNDARIA","HIPOLITO TUPAC AMARU","",null,0,0,0,0,0,0,0,0,0,0,0,0,0,0,0,null,0,0,0,0]
["SECUNDARIA","HIPOLITO TUPAC AMARU","",null,0,0,0,0,0,0,0,0,0,0,0,0,0,0,0,null,0,0,0,0]
["SECUNDARIA","HIPOLITO TUPAC AMARU","",null,0,0,0,0,0,0,0,0,0,0,0,0,0,0,0,null,0,0,0,0]
["SECUNDARIA","HIPOLITO TUPAC AMARU","",null,0,0,0,0,0,0,0,0,0,0,0,0,0,0,0,null,0,0,0,0]
["SECUNDARIA","HIPOLITO TUPAC AMARU","",null,0,0,0,0,0,0,0,0,0,0,0,0,0,0,0,null,0,0,0,0]
["SECUNDARIA","HIPOLITO TUPAC AMARU","",null,0,0,0,0,0,0,0,0,0,0,0,0,0,0,0,null,0,0,0,0]
["SECUNDARIA","HIPOLITO TUPAC AMARU","",null,0,0,0,0,0,0,0,0,0,0,0,0,0,0,0,null,0,0,0,0]
["SECUNDARIA","HIPOLITO TUPAC AMARU","",null,0,0,0,0,0,0,0,0,0,0,0,0,0,0,0,null,0,0,0,0]
["SECUNDARIA","HIPOLITO TUPAC AMARU","",null,0,0,0,0,0,0,0,0,0,0,0,0,0,0,0,null,0,0,0,0]
["SECUNDARIA","HIPOLITO TUPAC AMARU","",null,0,0,0,0,0,0,0,0,0,0,0,0,0,0,0,null,0,0,0,0]
["SECUNDARIA","HIPOLITO TUPAC AMARU","",null,0,0,0,0,0,0,0,0,0,0,0,0,0,0,0,null,0,0,0,0]
["SECUNDARIA","HIPOLITO TUPAC AMARU","",null,0,0,0,0,0,0,0,0,0,0,0,0,0,0,0,null,0,0,0,0]
["SECUNDARIA","HIPOLITO TUPAC AMARU","",null,0,0,0,0,0,0,0,0,0,0,0,0,0,0,0,null,0,0,0,0]
["SECUNDARIA","HIPOLITO TUPAC AMARU","",null,0,0,0,0,0,0,0,0,0,0,0,0,0,0,0,null,0,0,0,0]
["SECUNDARIA","HIPOLITO TUPAC AMARU","",null,0,0,0,0,0,0,0,0,0,0,0,0,0,0,0,null,0,0,0,0]
["SECUNDARIA","HIPOLITO TUPAC AMARU","",null,0,0,0,0,0,0,0,0,0,0,0,0,0,0,0,null,0,0,0,0]

{"sheet":"ACTA","index":9,"n_rows":11,"n_cols":2,"rows_kept":11,"hidden":true,"merged":[[1,1,1,20],[2,1,2,20],[4,1,4,20],[6,1,6,20],[8,1,8,20],[10,1,10,20]]}
[]
[]
[null,"ACTA DE REUNIÓN DE LA COMISIÓN DE CUADRO DE HORAS"]
[]
[null,"     Siendo el día  del mes de diciembre de 2019, se reunen en la sede de la UGEL Canas, la Comisión de Cuadro de Horas de la Sede; el Director y la Comisión de Cuadro de Horas de la IIEE RICARDO PALMA para revisar y aprobar el Cuadro de Horas 2020;"]
[]
[null,"     Se acuerda que el Cuadro de Horas aprobado no será modificado por ningún motivo durante el año lectivo 2020, salvo el proceso de racionalización que por norma expresa así lo señala."]
[]
[null,"    La Comisión de Cuadro de Horas de la institución educativa, mediante Oficio, ingresará por mesa de partes de la UGEL Canas el presente Cuadro de Horas, el mismo que ha sido elaborado en el aplicativo excel, ha sido revisado y posteriormente visado y aprobado por ambas Comisiones."]
[]
[null,"    Firman en señal de conformidad los integrantes de las Comisiones de Cuadro de Horas."]

{"sheet":"DATA","index":10,"n_rows":213,"n_cols":25,"rows_kept":213,"hidden":true,"merged":[[0,3,0,4],[0,7,0,8]]}
[null,null,"CARGO","LEY",null,"Área\n(Gest. Pedg. - \nGest. Instit.)",null,"CODIGO_ PLAZA",null,"J_L","Horas de Dictado",null,"EXCE\nDENCIA","APELLIDOS_NOMBRES","DNI","ESPECIALIDAD - TITULO","ESCALA \nMAGIST.","TIEMPO_SERVICIOS","OBSERVACIONES\n","GESTION","NIVEL_EDUCATIVO","NOMBRE_IE","SITUACION","ESTADO","TIPO_REGISTRO"]
[null,null,"Prof. x Horas","Ley N° 29944",null,"Gest. Pedg.",null,"426221211711",null,30,{"$nulls":3},"VACANTE",{"$nulls":5},"PÚBLICA","SECUNDARIA","CPED - 56378","CONTRATADO","ACTIVO","ORGÁNICA"]
[null,null,"Prof. x Horas","Ley N° 29944",null,"Gest. Pedg.",null,"426221211714",null,30,{"$nulls":3},"VACANTE",{"$nulls":5},"PÚBLICA","SECUNDARIA","CPED - 56378","CONTRATADO","ACTIVO","ORGÁNICA"]
[null,null,"Prof. x Horas","Ley N° 29944",null,"Gest. Pedg.",null,"426221211715",null,30,{"$nulls":3},"VACANTE",{"$nulls":5},"PÚBLICA","SECUNDARIA","CPED - 56378","CONTRATADO","ACTIVO","ORGÁNICA"]
[null,null,"Prof. x Horas","Ley N° 29944",null,"Gest. Pedg.",null,"428271214712",null,30,{"$nulls":3},"VACANTE",{"$nulls":5},"PÚBLICA","SECUNDARIA","CPED - 56378","CONTRATADO","ACTIVO","ORGÁNICA"]
[null,null,"Prof. x Horas","Ley N° 29944",null,"Gest. Pedg.",null,"428271214714",null,30,{"$nulls":3},"VACANTE",{"$nulls":5},"PÚBLICA","SECUNDARIA","CPED - 56378","CONTRATADO","ACTIVO","ORGÁNICA"]
[null,null,"Prof. x Horas","Ley N° 29944",null,"Gest. Pedg.",null,"428271214718",null,30,{"$nulls":3},"VACANTE",{"$nulls":5},"PÚBLICA","SECUNDARIA","CPED - 56378","CONTRATADO","ACTIVO","ORGÁNICA"]
[null,null,"Prof. x Horas","Ley N° 29944",null,"Gest. Pedg.",null,"428291214717",null,30,{"$nulls":3},"VACANTE",{"$nulls":5},"PÚBLICA","SECUNDARIA","CPED - 56378","CONTRATADO","ACTIVO","ORGÁNICA"]
[null,null,"Director(a)","Ley N° 29944",null,"Gest. Inst.",null,"428231212712",null,"40 CRONOL.",12,null,null,"VACANTE",{"$nulls":5},"PÚBLICA","SECUNDARIA","MICAELA BASTIDAS","ENCARGATURA","ACTIVO","ORGÁNICA"]
[null,null,"Prof. x Horas","Ley N° 29944",null,"Gest. Pedg.",null,"428231212710",null,30,{"$nulls":3},"ARQQUE LINARES, Saturnino","24576678","CIENCIAS SOCIALES",3,null,null,"PÚBLICA","SECUNDARIA","MICAELA BASTIDAS","NOMBRADO","ACTIVO","ORGÁNICA"]
[null,null,"Prof. x Horas","Ley N° 29944",null,"Gest. Pedg.",null,"428231212719",null,30,{"$nulls":3},"APAZA MAMANI, Elsa","01324628","CIENCIA Y TECNOLOGÍA",3,null,null,"PÚBLICA","SECUNDARIA","MICAELA BASTIDAS","NOMBRADO","ACTIVO","ORGÁNICA"]
[null,null,"Prof. x Horas","Ley N° 29944",null,"Gest. Pedg.",null,"428251212717",null,30,{"$nulls":3},"CALLO ZAPATA, Ricardo","24561020","COMUNICACIÓN",3,null,null,"PÚBLICA","SECUNDARIA","MICAELA BASTIDAS","NOMBRADO","ACTIVO","ORGÁNICA"]
[null,null,"Prof. x Horas","Ley N° 29944",null,"Gest. Pedg.",null,"428231212711",null,30,{"$nulls":3},"PUMALIQUE RUELAS, Demetrio","24674753","MATEMÁTICA",1,null,null,"PÚBLICA","SECUNDARIA","MICAELA BASTIDAS","NOMBRADO","ACTIVO","ORGÁNICA"]
[null,null,"Prof. x Horas","Ley N° 29944",null,"Gest. Pedg.",null,"428231212714",null,30,{"$nulls":3},"JIHUALLANCA QUISPE, Juan Vicente","40141504",null,1,null,null,"PÚBLICA","SECUNDARIA","MICAELA BASTIDAS","NOMBRADO","ACTIVO","ORGÁNICA"]
[null,null,"Prof. x Horas","Ley N° 29944",null,"Gest. Pedg.",null,"428231212718",null,30,{"$nulls":3},"VACANTE",{"$nulls":5},"PÚBLICA","SECUNDARIA","MICAELA BASTIDAS","CONTRATADO","ACTIVO","ORGÁNICA"]
[null,null,"Prof. x Horas","Ley N° 29944",null,"Gest. Pedg.",null,"428251212713",null,30,{"$nulls":3},"VACANTE",{"$nulls":5},"PÚBLICA","SECUNDARIA","MICAELA BASTIDAS","CONTRATADO","ACTIVO","ORGÁNICA"]
[null,null,"Prof. x Horas","Ley N° 29944",null,"Gest. Pedg.",null,"426211219713",null,30,{"$nulls":3},"PEREDO PAUCAR, Fortunato",24705961,"MATEMÁTICA",2,null,null,"PÚBLICA","SECUNDARIA","DANIEL ESTRADA PEREZ","NOMBRADO","ACTIVO","ORGÁNICA"]
[null,null,"Prof. x Horas","Ley N° 29944",null,"Gest. Pedg.",null,"426211219710",null,30,{"$nulls":3},"CRUZ NINA, Yoni",23998572,"COMUNICACIÓN",1,null,null,"PÚBLICA","SECUNDARIA","DANIEL ESTRADA PEREZ","NOMBRADO","ACTIVO","ORGÁNICA"]
[null,null,"Prof. x Horas","Ley N° 29944",null,"Gest. Pedg.",null,"426241219712",null,30,{"$nulls":3},"QUISPE CHALCO, Priato",24576923,"ARTE",1,null,null,"PÚBLICA","SECUNDARIA","DANIEL ESTRADA PEREZ","NOMBRADO","ACTIVO","ORGÁNICA"]
[null,null,"Prof. x Horas","Ley N° 29944",null,"Gest. Pedg.",null,"426211219716",null,30,{"$nulls":3},"VACANTE",{"$nulls":5},"PÚBLICA","SECUNDARIA","DANIEL ESTRADA PEREZ","CONTRATADO","ACTIVO","ORGÁNICA"]
[null,null,"Prof. x Horas","Ley N° 29944",null,"Gest. Pedg.",null,"426211219717",null,30,{"$nulls":3},"VACANTE",{"$nulls":5},"PÚBLICA","SECUNDARIA","DANIEL ESTRADA PEREZ","CONTRATADO","ACTIVO","ORGÁNICA"]
[null,null,"Prof. x Horas","Ley N° 29944",null,"Gest. Pedg.",null,"426211219719",null,30,{"$nulls":3},"VACANTE",{"$nulls":5},"PÚBLICA","SECUNDARIA","DANIEL ESTRADA PEREZ","CONTRATADO","ACTIVO","ORGÁNICA"]
[null,null,"Prof. x Horas","Ley N° 29944",null,"Gest. Pedg.",null,"426241219718",null,30,{"$nulls":3},"VACANTE",{"$nulls":5},"PÚBLICA","SECUNDARIA","DANIEL ESTRADA PEREZ","CONTRATADO","ACTIVO","ORGÁNICA"]
[null,null,"Director(a)","Ley N° 29944",null,"Gest. Inst.",null,"426261215717",null,"40 CRONOL.",12,null,null,"VACANTE",{"$nulls":5},"PÚBLICA","SECUNDARIA","SAN BARTOLOME","ENCARGATURA","ACTIVO","ORGÁNICA"]
[null,null,"Prof. x Horas","Ley N° 29944",null,"Gest. Pedg.",null,"426201216713",null,30,{"$nulls":3},"VACANTE",{"$nulls":5},"PÚBLICA","SECUNDARIA","SAN BARTOLOME","CONTRATADO","ACTIVO","ORGÁNICA"]
[null,null,"Prof. x Horas","Ley N° 29944",null,"Gest. Pedg.",null,"426201216716",null,30,{"$nulls":3},"VACANTE",{"$nulls":5},"PÚBLICA","SECUNDARIA","SAN BARTOLOME","CONTRATADO","ACTIVO","ORGÁNICA"]
[null,null,"Prof. x Horas","Ley N° 29944",null,"Gest. Pedg.",null,"426201216717",null,30,{"$nulls":3},"VACANTE",{"$nulls":5},"PÚBLICA","SECUNDARIA","SAN BARTOLOME","CONTRATADO","ACTIVO","ORGÁNICA"]
[null,null,"Prof. x Horas","Ley N° 29944",null,"Gest. Pedg.",null,"426251216712",null,30,{"$nulls":3},"VACANTE",{"$nulls":5},"PÚBLICA","SECUNDARIA","SAN BARTOLOME","CONTRATADO","ACTIVO","ORGÁNICA"]
[null,null,"Prof. x Horas","Ley N° 29944",null,"Gest. Pedg.",null,"426251216714",null,30,{"$nulls":3},"VACANTE",{"$nulls":5},"PÚBLICA","SECUNDARIA","SAN BARTOLOME","CONTRATADO","ACTIVO","ORGÁNICA"]
[null,null,"Prof. x Horas","Ley N° 29944",null,"Gest. Pedg.",null,"426251216715",null,30,{"$nulls":3},"VACANTE",{"$nulls":5},"PÚBLICA","SECUNDARIA","SAN BARTOLOME","CONTRATADO","ACTIVO","ORGÁNICA"]
[null,null,"Prof. x Horas","Ley N° 29944",null,"Gest. Pedg.",null,"426251216718",null,30,{"$nulls":3},"VACANTE",{"$nulls":5},"PÚBLICA","SECUNDARIA","SAN BARTOLOME","CONTRATADO","ACTIVO","ORGÁNICA"]
[null,null,"Prof. x Horas","Ley N° 29944",null,"Gest. Pedg.",null,"426241215714",null,30,{"$nulls":3},"JAVIER FLORES, Forentino",24578104,"EPT",1,null,null,"PÚBLICA","SECUNDARIA","FERNANDO BELAUNDE TERRI","CONTRATADO","ACTIVO","ORGÁNICA"]
[null,null,"Prof. x Horas","Ley N° 29944",null,"Gest. Pedg.",null,"426211215713",null,30,{"$nulls":3},"VACANTE",{"$nulls":5},"PÚBLICA","SECUNDARIA","FERNANDO BELAUNDE TERRI","CONTRATADO","ACTIVO","ORGÁNICA"]
[null,null,"Prof. x Horas","Ley N° 29944",null,"Gest. Pedg.",null,"426211215716",null,30,{"$nulls":3},"VACANTE",{"$nulls":5},"PÚBLICA","SECUNDARIA","FERNANDO BELAUNDE TERRI","CONTRATADO","ACTIVO","ORGÁNICA"]
[null,null,"Prof. x Horas","Ley N° 29944",null,"Gest. Pedg.",null,"426211215717",null,30,{"$nulls":3},"VACANTE",{"$nulls":5},"PÚBLICA","SECUNDARIA","FERNANDO BELAUNDE TERRI","CONTRATADO","ACTIVO","ORGÁNICA"]
[null,null,"Prof. x Horas","Ley N° 29944",null,"Gest. Pedg.",null,"426241215712",null,30,{"$nulls":3},"VACANTE",{"$nulls":5},"PÚBLICA","SECUNDARIA","FERNANDO BELAUNDE TERRI","CONTRATADO","ACTIVO","ORGÁNICA"]
[null,null,"Prof. x Horas","Ley N° 29944",null,"Gest. Pedg.",null,"426241215715",null,30,{"$nulls":3},"VACANTE",{"$nulls":5},"PÚBLICA","SECUNDARIA","FERNANDO BELAUNDE TERRI","CONTRATADO","ACTIVO","ORGÁNICA"]
[null,null,"Prof. x Horas","Ley N° 29944",null,"Gest. Pedg.",null,"426241215718",null,30,{"$nulls":3},"VACANTE",{"$nulls":5},"PÚBLICA","SECUNDARIA","FERNANDO BELAUNDE TERRI","CONTRATADO","ACTIVO","ORGÁNICA"]
[null,null,"Prof. x Horas","Ley N° 29944",null,"Gest. Pedg.",null,"426271215711",null,30,{"$nulls":3},"FLORES ORDOÑEZ, Percy","01301253","ARTE",2,null,null,"PÚBLICA","SECUNDARIA","INCA TUPAC AMARU","NOMBRADO","ACTIVO","ORGÁNICA"]
[null,null,"Prof. x Horas","Ley N° 29944",null,"Gest. Pedg.",null,"426271215712",null,30,{"$nulls":3},"VACANTE",{"$nulls":5},"PÚBLICA","SECUNDARIA","INCA TUPAC AMARU","CONTRATADO","ACTIVO","ORGÁNICA"]
[null,null,"Prof. x Horas","Ley N° 29944",null,"Gest. Pedg.",null,"426271215714",null,30,{"$nulls":3},"VACANTE",{"$nulls":5},"PÚBLICA","SECUNDARIA","INCA TUPAC AMARU","CONTRATADO","ACTIVO","ORGÁNICA"]
[null,null,"Prof. x Horas","Ley N° 29944",null,"Gest. Pedg.",null,"426271215715",null,30,{"$nulls":3},"VACANTE",{"$nulls":5},"PÚBLICA","SECUNDARIA","INCA TUPAC AMARU","CONTRATADO","ACTIVO","ORGÁNICA"]
[null,null,"Prof. x Horas","Ley N° 29944",null,"Gest. Pedg.",null,"426271215718",null,30,{"$nulls":3},"VACANTE",{"$nulls":5},"PÚBLICA","SECUNDARIA","INCA TUPAC AMARU","CONTRATADO","ACTIVO","ORGÁNICA"]
[null,null,"Prof. x Horas","Ley N° 29944",null,"Gest. Pedg.",null,"426291215716",null,30,{"$nulls":3},"VACANTE",{"$nulls":5},"PÚBLICA","SECUNDARIA","INCA TUPAC AMARU","CONTRATADO","ACTIVO","ORGÁNICA"]
[null,null,"Prof. x Horas","Ley N° 29944",null,"Gest. Pedg.",null,"426291215717",null,30,{"$nulls":3},"VACANTE",{"$nulls":5},"PÚBLICA","SECUNDARIA","INCA TUPAC AMARU","CONTRATADO","ACTIVO","ORGÁNICA"]
[null,null,"Prof. x Horas","Ley N° 29944",null,"Gest. Pedg.",null,"426201215719",null,30,{"$nulls":3},"MEDINA DELGADILLO, Marco Antonio","24706395","EDUCACIÓN PARA EL TRABAJO",2,null,null,"PÚBLICA","SECUNDARIA","RICARDO PALMA","NOMBRADO","ACTIVO","ORGÁNICA"]
[null,null,"Prof. x Horas","Ley N° 29944",null,"Gest. Pedg.",null,"426201215710",null,30,{"$nulls":3},"QUISPE TAVERA, Jorge Ivan","01491398","EDUCACIÓN FÍSICA",1,null,null,"PÚBLICA","SECUNDARIA","RICARDO PALMA","NOMBRADO","ACTIVO","ORGÁNICA"]
[null,null,"Prof. x Horas","Ley N° 29944",null,"Gest. Pedg.",null,"426201215711",null,30,{"$nulls":3},"LAZO RIVERA, Nicolas Andrés","29720005","CIENCIAS SOCIALES",1,null,null,"PÚBLICA","SECUNDARIA","RICARDO PALMA","NOMBRADO","ACTIVO","ORGÁNICA"]
[null,null,"Prof. x Horas","Ley N° 29944",null,"Gest. Pedg.",null,"426201215713",null,30,{"$nulls":3},"SABINA ESCARCENA, Nelly Soledad","41232413","COMUNICACIÓN",1,null,null,"PÚBLICA","SECUNDARIA","RICARDO PALMA","NOMBRADO","ACTIVO","ORGÁNICA"]
[null,null,"Prof. x Horas","Ley N° 29944",null,"Gest. Pedg.",null,"426201215716",null,30,{"$nulls":3},"CONDO SALAS, Matilde","24583880","CIENCIA Y TECNOLOGÍA",1,null,null,"PÚBLICA","SECUNDARIA","RICARDO PALMA","NOMBRADO","ACTIVO","ORGÁNICA"]
[null,null,"Prof. x Horas","Ley N° 29944",null,"Gest. Pedg.",null,"426201215717",null,30,{"$nulls":3},"VACANTE",{"$nulls":5},"PÚBLICA","SECUNDARIA","RICARDO PALMA","CONTRATADO","ACTIVO","ORGÁNICA"]
[null,null,"Prof. x Horas","Ley N° 29944",null,"Gest. Pedg.",null,"426251215712",null,30,{"$nulls":3},"VACANTE",{"$nulls":5},"PÚBLICA","SECUNDARIA","RICARDO PALMA","CONTRATADO","ACTIVO","ORGÁNICA"]
[null,null,"Prof. x Horas","Ley N° 29944",null,"Gest. Pedg.",null,"426281211712",null,30,{"$nulls":3},"VACANTE","01552172","COMUNICACIÓN",3,null,null,"PÚBLICA","SECUNDARIA",56108,"NOMBRADO","ACTIVO","ORGÁNICA"]
[null,null,"Prof. x Horas","Ley N° 29944",null,"Gest. Pedg.",null,"426281211710",null,30,{"$nulls":3},"APAZA LUQUE, HERBERT JHON","40754113","MATEMÁTICA",2,null,null,"PÚBLICA","SECUNDARIA",56108,"NOMBRADO","ACTIVO","ORGÁNICA"]
[null,null,"Prof. x Horas","Ley N° 29944",null,"Gest. Pedg.",null,"426281211711",null,30,{"$nulls":3},"CAHUANA HANCCO, MARINA","40360754","MATEMÁTICA",2,null,null,"PÚBLICA","SECUNDARIA",56108,"NOMBRADO","ACTIVO","ORGÁNICA"]
[null,null,"Prof. x Horas","Ley N° 29944",null,"Gest. Pedg.",null,"426281211715",null,30,{"$nulls":3},"HUILLCA HUARAYA, URBANO","24582867",null,2,null,null,"PÚBLICA","SECUNDARIA",56108,"NOMBRADO","ACTIVO","ORGÁNICA"]
[null,null,"Prof. x Horas","Ley N° 29944",null,"Gest. Pedg.",null,"426281211719",null,30,{"$nulls":3},"VELASCO ZUÑIGA, JIMI","42275348","EDUCACIÓN FÍSICA",2,null,null,"PÚBLICA","SECUNDARIA",56108,"NOMBRADO","ACTIVO","ORGÁNICA"]
[null,null,"Prof. x Horas","Ley N° 29944",null,"Gest. Pedg.",null,"426281211714",null,30,{"$nulls":3},"VACANTE",null,null,1,null,null,"PÚBLICA","SECUNDARIA",56108,"CONTRATADO","ACTIVO","ORGÁNICA"]
[null,null,"Prof. x Horas","Ley N° 29944",null,"Gest. Pedg.",null,"426281211718",null,30,{"$nulls":3},"VACANTE",null,null,1,null,null,"PÚBLICA","SECUNDARIA",56108,"CONTRATADO","ACTIVO","ORGÁNICA"]
[null,null,"Prof. x Horas","Ley N° 29944",null,"Gest. Pedg.",null,"426261211712",null,30,{"$nulls":3},"CACERES ARIZACA, OSCAR","24718051","EDUCACIÓN FÍSICA",3,null,null,"PÚBLICA","SECUNDARIA",56110,"NOMBRADO","ACTIVO","ORGÁNICA"]
[null,null,"Prof. x Horas","Ley N° 29944",null,"Gest. Pedg.",null,"426261211714",null,30,{"$nulls":3},"FLORES TORRES, MARISOL ROXANA","25001506","COMUNICACIÓN",3,null,null,"PÚBLICA","SECUNDARIA",56110,"NOMBRADO","ACTIVO","ORGÁNICA"]
[null,null,"Prof. x Horas","Ley N° 29944",null,"Gest. Pedg.",null,"428221212710",null,30,{"$nulls":3},"VACANTE","23919400","COMUNICACIÓN",3,null,null,"PÚBLICA","SECUNDARIA",56110,"NOMBRADO","ACTIVO","ORGÁNICA"]
[null,null,"Prof. x Horas","Ley N° 29944",null,"Gest. Pedg.",null,"426281211713",null,30,{"$nulls":3},"VACANTE","24707126","CIENCIA Y TECNOLOGIA",2,null,null,"PÚBLICA","SECUNDARIA",56110,"NOMBRADO","ACTIVO","ORGÁNICA"]
[null,null,"Prof. x Horas","Ley N° 29944",null,"Gest. Pedg.",null,"426261211718",null,30,{"$nulls":3},"NINA QUISPE, ALEJANDRO","24665087",null,1,null,null,"PÚBLICA","SECUNDARIA",56110,"NOMBRADO","ACTIVO","ORGÁNICA"]
[null,null,"Prof. x Horas","Ley N° 29944",null,"Gest. Pedg.",null,"426281211716",null,30,{"$nulls":3},"ARIAS ALFARO, ROBERTO","24706323","CIENCIAS SOCIALES",1,null,null,"PÚBLICA","SECUNDARIA",56110,"NOMBRADO","ACTIVO","ORGÁNICA"]
[null,null,"Prof. x Horas","Ley N° 29944",null,"Gest. Pedg.",null,"426281211717",null,30,{"$nulls":3},"CUMPA HUAMAN, FELICIANO","24708687","MATEMÁTICA",1,null,null,"PÚBLICA","SECUNDARIA",56110,"NOMBRADO","ACTIVO","ORGÁNICA"]
[null,null,"Prof. x Horas","Ley N° 29944",null,"Gest. Pedg.",null,"426261211710",null,30,{"$nulls":3},"VACANTE","23951533","EDUCACIÓN FÍSICA",3,null,null,"PÚBLICA","SECUNDARIA",56113,"NOMBRADO","ACTIVO","ORGÁNICA"]
[null,null,"Prof. x Horas","Ley N° 29944",null,"Gest. Pedg.",null,"426261211713",null,30,{"$nulls":3},"MAMANI CUTIRE, ELIZABETH CARMEN","44096852","MATEMÁTICA",3,null,null,"PÚBLICA","SECUNDARIA",56113,"NOMBRADO","ACTIVO","ORGÁNICA"]
[null,null,"Prof. x Horas","Ley N° 29944",null,"Gest. Pedg.",null,"426261211717",null,30,{"$nulls":3},"VACANTE","24692772","CIENCIA Y TECNOLOGÍA",2,null,null,"PÚBLICA","SECUNDARIA",56113,"NOMBRADO","ACTIVO","ORGÁNICA"]
[null,null,"Prof. x Horas","Ley N° 29944",null,"Gest. Pedg.",null,"426261211715",null,30,{"$nulls":3},"CONDO MAMANI, JOELIA","41555980","COMUNICACIÓN",1,null,null,"PÚBLICA","SECUNDARIA",56113,"NOMBRADO","ACTIVO","ORGÁNICA"]
[null,null,"Prof. x Horas","Ley N° 29944",null,"Gest. Pedg.",null,"426261211719",null,30,{"$nulls":3},"QUISPE PINTO, DUBERLI GILDER","29474010","CIENCIAS SOCIALES",1,null,null,"PÚBLICA","SECUNDARIA",56113,"NOMBRADO","ACTIVO","ORGÁNICA"]
[null,null,"Prof. x Horas","Ley N° 29944",null,"Gest. Pedg.",null,"426261211711",null,30,{"$nulls":3},"VACANTE",{"$nulls":5},"PÚBLICA","SECUNDARIA",56113,"CONTRATADO","ACTIVO","ORGÁNICA"]
[null,null,"Prof. x Horas","Ley N° 29944",null,"Gest. Pedg.",null,"426261211716",null,30,{"$nulls":3},"VACANTE",{"$nulls":5},"PÚBLICA","SECUNDARIA",56113,"CONTRATADO","ACTIVO","ORGÁNICA"]
[null,null,"Prof. x Horas","Ley N° 29944",null,"Gest. Pedg.",null,"426291211710",null,30,{"$nulls":3},"VACANTE",{"$nulls":5},"PÚBLICA","SECUNDARIA",56267,"CONTRATADO","ACTIVO","ORGÁNICA"]
[null,null,"Prof. x Horas","Ley N° 29944",null,"Gest. Pedg.",null,"426291211711",null,30,{"$nulls":3},"VACANTE",{"$nulls":5},"PÚBLICA","SECUNDARIA",56267,"CONTRATADO","ACTIVO","ORGÁNICA"]
[null,null,"Prof. x Horas","Ley N° 29944",null,"Gest. Pedg.",null,"426291211712",null,30,{"$nulls":3},"VACANTE",{"$nulls":5},"PÚBLICA","SECUNDARIA",56267,"CONTRATADO","ACTIVO","ORGÁNICA"]
[null,null,"Prof. x Horas","Ley N° 29944",null,"Gest. Pedg.",null,"426291211714",null,30,{"$nulls":3},"VACANTE",{"$nulls":5},"PÚBLICA","SECUNDARIA",56267,"CONTRATADO","ACTIVO","ORGÁNICA"]
[null,null,"Prof. x Horas","Ley N° 29944",null,"Gest. Pedg.",null,"426291211715",null,30,{"$nulls":3},"VACANTE",{"$nulls":5},"PÚBLICA","SECUNDARIA",56267,"CONTRATADO","ACTIVO","ORGÁNICA"]
[null,null,"Prof. x Horas","Ley N° 29944",null,"Gest. Pedg.",null,"426291211718",null,30,{"$nulls":3},"VACANTE",{"$nulls":5},"PÚBLICA","SECUNDARIA",56267,"CONTRATADO","ACTIVO","ORGÁNICA"]
[null,null,"Prof. x Horas","Ley N° 29944",null,"Gest. Pedg.",null,"426291211719",null,30,{"$nulls":3},"VACANTE",{"$nulls":5},"PÚBLICA","SECUNDARIA",56267,"CONTRATADO","ACTIVO","ORGÁNICA"]
[null,null,"Prof. x Horas","Ley N° 29944",null,"Gest. Pedg.",null,"426271211712",null,30,{"$nulls":3},"VACANTE",{"$nulls":5},"PÚBLICA","SECUNDARIA",56283,"CONTRATADO","ACTIVO","ORGÁNICA"]
[null,null,"Prof. x Horas","Ley N° 29944",null,"Gest. Pedg.",null,"426271211714",null,30,{"$nulls":3},"VACANTE",{"$nulls":5},"PÚBLICA","SECUNDARIA",56283,"CONTRATADO","ACTIVO","ORGÁNICA"]
[null,null,"Prof. x Horas","Ley N° 29944",null,"Gest. Pedg.",null,"426271211715",null,30,{"$nulls":3},"VACANTE",{"$nulls":5},"PÚBLICA","SECUNDARIA",56283,"CONTRATADO","ACTIVO","ORGÁNICA"]
[null,null,"Prof. x Horas","Ley N° 29944",null,"Gest. Pedg.",null,"426271211718",null,30,{"$nulls":3},"VACANTE",{"$nulls":5},"PÚBLICA","SECUNDARIA",56283,"CONTRATADO","ACTIVO","ORGÁNICA"]
[null,null,"Prof. x Horas","Ley N° 29944",null,"Gest. Pedg.",null,"426291211713",null,30,{"$nulls":3},"VACANTE",{"$nulls":5},"PÚBLICA","SECUNDARIA",56283,"CONTRATADO","ACTIVO","ORGÁNICA"]
[null,null,"Prof. x Horas","Ley N° 29944",null,"Gest. Pedg.",null,"426291211716",null,30,{"$nulls":3},"VACANTE",{"$nulls":5},"PÚBLICA","SECUNDARIA",56283,"CONTRATADO","ACTIVO","ORGÁNICA"]
[null,null,"Prof. x Horas","Ley N° 29944",null,"Gest. Pedg.",null,"426291211717",null,30,{"$nulls":3},"VACANTE",{"$nulls":5},"PÚBLICA","SECUNDARIA",56283,"CONTRATADO","ACTIVO","ORGÁNICA"]
[null,null,"Prof. x Horas","Ley N° 29944",null,"Gest. Pedg.",null,"426221211712",null,30,{"$nulls":3},"CUNO MAMANI, CAROLINA VERONICA","01545907","MATEMÁTICA",3,null,null,"PÚBLICA","SECUNDARIA",56392,"NOMBRADO","ACTIVO","ORGÁNICA"]
[null,null,"Prof. x Horas","Ley N° 29944",null,"Gest. Pedg.",null,"426271211719",null,30,{"$nulls":3},"QUISPE TORRES, ROGER","02147488",null,2,null,null,"PÚBLICA","SECUNDARIA",56392,"NOMBRADO","ACTIVO","ORGÁNICA"]
[null,null,"Prof. x Horas","Ley N° 29944",null,"Gest. Pedg.",null,"426221211718",null,30,{"$nulls":3},"VACANTE",{"$nulls":5},"PÚBLICA","SECUNDARIA",56392,"CONTRATADO","ACTIVO","ORGÁNICA"]
[null,null,"Prof. x Horas","Ley N° 29944",null,"Gest. Pedg.",null,"426271211710",null,30,{"$nulls":3},"VACANTE",{"$nulls":5},"PÚBLICA","SECUNDARIA",56392,"CONTRATADO","ACTIVO","ORGÁNICA"]
[null,null,"Prof. x Horas","Ley N° 29944",null,"Gest. Pedg.",null,"426271211711",null,30,{"$nulls":3},"VACANTE",{"$nulls":5},"PÚBLICA","SECUNDARIA",56392,"CONTRATADO","ACTIVO","ORGÁNICA"]
[null,null,"Prof. x Horas","Ley N° 29944",null,"Gest. Pedg.",null,"426271211716",null,30,{"$nulls":3},"VACANTE",{"$nulls":5},"PÚBLICA","SECUNDARIA",56392,"CONTRATADO","ACTIVO","ORGÁNICA"]
[null,null,"Prof. x Horas","Ley N° 29944",null,"Gest. Pedg.",null,"426271211717",null,30,{"$nulls":3},"VACANTE",{"$nulls":5},"PÚBLICA","SECUNDARIA",56392,"CONTRATADO","ACTIVO","ORGÁNICA"]
[null,null,"Prof. x Horas","Ley N° 29944",null,"Gest. Pedg.",null,"426271219711",null,30,{"$nulls":3},"VACANTE",{"$nulls":5},"PÚBLICA","SECUNDARIA","HIPOLITO TÚPAC AMARU","CONTRATADO","ACTIVO","ORGÁNICA"]
[null,null,"Prof. x Horas","Ley N° 29944",null,"Gest. Pedg.",null,"426271219712",null,30,{"$nulls":3},"VACANTE",{"$nulls":5},"PÚBLICA","SECUNDARIA","HIPOLITO TÚPAC AMARU","CONTRATADO","ACTIVO","ORGÁNICA"]
[null,null,"Prof. x Horas","Ley N° 29944",null,"Gest. Pedg.",null,"426271219714",null,30,{"$nulls":3},"VACANTE",{"$nulls":5},"PÚBLICA","SECUNDARIA","HIPOLITO TÚPAC AMARU","CONTRATADO","ACTIVO","ORGÁNICA"]
[null,null,"Prof. x Horas","Ley N° 29944",null,"Gest. Pedg.",null,"426271219715",null,30,{"$nulls":3},"VACANTE",{"$nulls":5},"PÚBLICA","SECUNDARIA","HIPOLITO TÚPAC AMARU","CONTRATADO","ACTIVO","ORGÁNICA"]
[null,null,"Prof. x Horas","Ley N° 29944",null,"Gest. Pedg.",null,"426271219718",null,30,{"$nulls":3},"VACANTE",{"$nulls":5},"PÚBLICA","SECUNDARIA","HIPOLITO TÚPAC AMARU","CONTRATADO","ACTIVO","ORGÁNICA"]
[null,null,"Prof. x Horas","Ley N° 29944",null,"Gest. Pedg.",null,"426271219719",null,30,{"$nulls":3},"VACANTE",{"$nulls":5},"PÚBLICA","SECUNDARIA","HIPOLITO TÚPAC AMARU","CONTRATADO","ACTIVO","ORGÁNICA"]
[null,null,"Prof. x Horas","Ley N° 29944",null,"Gest. Pedg.",null,"426291219717",null,30,{"$nulls":3},"VACANTE",{"$nulls":5},"PÚBLICA","SECUNDARIA","HIPOLITO TÚPAC AMARU","CONTRATADO","ACTIVO","ORGÁNICA"]
[null,null,"Prof. x Horas","Ley N° 29944",null,"Gest. Pedg.",null,"426231219711",null,30,{"$nulls":3},"GONZALES MAQUERA, ANGEL",null,null,1,null,null,"PÚBLICA","SECUNDARIA","SAN JUAN BAUTISTA","NOMBRADO","ACTIVO","ORGÁNICA"]
[null,null,"Prof. x Horas","Ley N° 29944",null,"Gest. Pedg.",null,"426231219710",null,30,{"$nulls":3},"VACANTE",{"$nulls":5},"PÚBLICA","SECUNDARIA","SAN JUAN BAUTISTA","CONTRATADO","ACTIVO","ORGÁNICA"]
[null,null,"Prof. x Horas","Ley N° 29944",null,"Gest. Pedg.",null,"426231219713",null,30,{"$nulls":3},"VACANTE",{"$nulls":5},"PÚBLICA","SECUNDARIA","SAN JUAN BAUTISTA","CONTRATADO","ACTIVO","ORGÁNICA"]
[null,null,"Prof. x Horas","Ley N° 29944",null,"Gest. Pedg.",null,"426231219714",null,30,{"$nulls":3},"VACANTE",{"$nulls":5},"PÚBLICA","SECUNDARIA","SAN JUAN BAUTISTA","CONTRATADO","ACTIVO","ORGÁNICA"]
[null,null,"Prof. x Horas","Ley N° 29944",null,"Gest. Pedg.",null,"426231219715",null,30,{"$nulls":3},"VACANTE",{"$nulls":5},"PÚBLICA","SECUNDARIA","SAN JUAN BAUTISTA","CONTRATADO","ACTIVO","ORGÁNICA"]
[null,null,"Prof. x Horas","Ley N° 29944",null,"Gest. Pedg.",null,"426231219716",null,30,{"$nulls":3},"VACANTE",{"$nulls":5},"PÚBLICA","SECUNDARIA","SAN JUAN BAUTISTA","CONTRATADO","ACTIVO","ORGÁNICA"]
[null,null,"Prof. x Horas","Ley N° 29944",null,"Gest. Pedg.",null,"426231219719",null,30,{"$nulls":3},"VACANTE",{"$nulls":5},"PÚBLICA","SECUNDARIA","SAN JUAN BAUTISTA","CONTRATADO","ACTIVO","ORGÁNICA"]
[null,null,"Sub Director(a)","Ley N° 29944",null,"Gest. Inst.",null,"08EV01623688",null,"40 CRONOL.",{"$nulls":3},"CONDE LOZANO, GUIDO",24714038,"COMUNICACIÓN",5,null,null,"PÚBLICA","SECUNDARIA","FERNANDO TÚPAC AMARU","DESIGNADO","ACTIVO","ORGÁNICA"]
[null,null,"Prof. x Horas","Ley N° 29944",null,"Gest. Pedg.",null,"428251212711",null,30,{"$nulls":3},"ANAHUE BERNA, DOROTEO MARTIN",24564470,null,1,null,null,"PÚBLICA","SECUNDARIA","FERNANDO TÚPAC AMARU","NOMBRADO","ACTIVO","ORGÁNICA"]
[null,null,"Prof. x Horas","Ley N° 29944",null,"Gest. Pedg.",null,"428251212712",null,30,{"$nulls":3},"BOLAÑOS RAMIREZ, GERMAN","24582778",null,1,null,null,"PÚBLICA","SECUNDARIA","FERNANDO TÚPAC AMARU","NOMBRADO","ACTIVO","ORGÁNICA"]
[null,null,"Prof. x Horas","Ley N° 29944",null,"Gest. Pedg.",null,"428251212714",null,30,{"$nulls":3},"NINA CONDEÑA, VICTOR","24579610",null,1,null,null,"PÚBLICA","SECUNDARIA","FERNANDO TÚPAC AMARU","NOMBRADO","ACTIVO","ORGÁNICA"]
[null,null,"Prof. x Horas","Ley N° 29944",null,"Gest. Pedg.",null,"428251212718",null,30,{"$nulls":3},"VILLANUEVA MEDINA, LUCIANO","29328311","CIENCIA Y TECNOLOGÍA",1,null,null,"PÚBLICA","SECUNDARIA","FERNANDO TÚPAC AMARU","NOMBRADO","ACTIVO","ORGÁNICA"]
[null,null,"Prof. x Horas","Ley N° 29944",null,"Gest. Pedg.",null,"08EV01707866",null,30,{"$nulls":3},"VACANTE",{"$nulls":5},"PÚBLICA","SECUNDARIA","FERNANDO TÚPAC AMARU","CONTRATADO","ACTIVO","ORGÁNICA"]
[null,null,"Prof. x Horas","Ley N° 29944",null,"Gest. Pedg.",null,"428201212717",null,30,{"$nulls":3},"VACANTE",{"$nulls":5},"PÚBLICA","SECUNDARIA","FERNANDO TÚPAC AMARU","CONTRATADO","ACTIVO","ORGÁNICA"]
[null,null,"Prof. x Horas","Ley N° 29944",null,"Gest. Pedg.",null,"428251212715",null,30,{"$nulls":3},"VACANTE",{"$nulls":5},"PÚBLICA","SECUNDARIA","FERNANDO TÚPAC AMARU","CONTRATADO","ACTIVO","ORGÁNICA"]
[null,null,"Prof. x Horas","Ley N° 29944",null,"Gest. Pedg.",null,"428251212719",null,30,{"$nulls":3},"VACANTE",{"$nulls":5},"PÚBLICA","SECUNDARIA","FERNANDO TÚPAC AMARU","CONTRATADO","ACTIVO","ORGÁNICA"]
[null,null,"Director(a)","Ley N° 29944",null,"Gest. Inst.",null,"08EV01623690",null,"40 CRONOL.",{"$nulls":3},"SERNA MARTINEZ, JUAN ADRIAN","24696036",null,3,null,null,"PÚBLICA","SECUNDARIA","HAMPATURA","DESIGNADO","ACTIVO","ORGÁNICA"]
[null,null,"Prof. AIP","Ley N° 29945",null,"Gest. Pedg.",{"$nulls":3},30,{"$nulls":3},"VACANTE",{"$nulls":5},"PÚBLICA","SECUNDARIA","HAMPATURA","CONTRATADO","ACTIVO","ORGÁNICA"]
[null,null,"Prof. x Horas","Ley N° 29944",null,"Gest. Pedg.",null,"426271211713",null,30,{"$nulls":3},"ZAIRA APAZA, EDWIN MAXIMO","01308713","MATEMÁTICA",2,null,null,"PÚBLICA","SECUNDARIA","HAMPATURA","NOMBRADO","ACTIVO","ORGÁNICA"]
[null,null,"Prof. x Horas","Ley N° 29944",null,"Gest. Pedg.",null,"428201212710",null,30,{"$nulls":3},"RAMOS CHILO, MARIA TEREZA","43274262","ARTE Y CULTURA",1,null,null,"PÚBLICA","SECUNDARIA","HAMPATURA","NOMBRADO","ACTIVO","ORGÁNICA"]
[null,null,"Prof. x Horas","Ley N° 29944",null,"Gest. Pedg.",null,"428201212714",null,30,{"$nulls":3},"MAMANI LABRA, APOLINIA LOURDES","23900290",null,1,null,null,"PÚBLICA","SECUNDARIA","HAMPATURA","NOMBRADO","ACTIVO","ORGÁNICA"]
[null,null,"Prof. x Horas","Ley N° 29944",null,"Gest. Pedg.",null,"428201212719",null,30,{"$nulls":3},"CAMPANA QUILLE, PERCY","42907041","EDUCACIÓN PARA EL TRABAJO",1,null,null,"PÚBLICA","SECUNDARIA","HAMPATURA","NOMBRADO","ACTIVO","ORGÁNICA"]
[null,null,"Prof. x Horas","Ley N° 29944",null,"Gest. Pedg.",null,"428221212717",null,30,{"$nulls":3},"NUÑONCCA CHAVEZ, JOSE ANTONIO","24715235","EDUCACIÓN FÍSICA",1,null,null,"PÚBLICA","SECUNDARIA","HAMPATURA","NOMBRADO","ACTIVO","ORGÁNICA"]
[null,null,"Prof. x Horas","Ley N° 29944",null,"Gest. Pedg.",null,"428201212711",null,30,{"$nulls":3},"CONDE LOZANO, GUIDO (DESIGNACIÓN COMO DIRECTIVO)",null,"COMUNICACIÓN",{"$nulls":3},"PÚBLICA","SECUNDARIA","HAMPATURA","CONTRATADO","ACTIVO","ORGÁNICA"]
[null,null,"Prof. x Horas","Ley N° 29944",null,"Gest. Pedg.",null,"428201212712",null,30,{"$nulls":3},"DELGADO ARTEAGA, JAIME (DESIGNACIÓN COMO DIRECTIVO)",null,"MATEMÁTICA",{"$nulls":3},"PÚBLICA","SECUNDARIA","HAMPATURA","CONTRATADO","ACTIVO","ORGÁNICA"]
[null,null,"Prof. x Horas","Ley N° 29944",null,"Gest. Pedg.",null,"428201212713",null,30,{"$nulls":3},"VACANTE",{"$nulls":5},"PÚBLICA","SECUNDARIA","HAMPATURA","CONTRATADO","ACTIVO","ORGÁNICA"]
[null,null,"Prof. x Horas","Ley N° 29944",null,"Gest. Pedg.",null,"428201212715",null,30,{"$nulls":3},"VACANTE",{"$nulls":5},"PÚBLICA","SECUNDARIA","HAMPATURA","CONTRATADO","ACTIVO","ORGÁNICA"]
[null,null,"Prof. x Horas","Ley N° 29944",null,"Gest. Pedg.",null,"428201212716",null,30,{"$nulls":3},"VACANTE",{"$nulls":5},"PÚBLICA","SECUNDARIA","HAMPATURA","CONTRATADO","ACTIVO","ORGÁNICA"]
[null,null,"Prof. x Horas","Ley N° 29944",null,"Gest. Pedg.",null,"428201212718",null,30,{"$nulls":3},"VACANTE",{"$nulls":5},"PÚBLICA","SECUNDARIA","HAMPATURA","CONTRATADO","ACTIVO","ORGÁNICA"]
[null,null,"Prof. x Horas","Ley N° 29944",null,"Gest. Pedg.",null,"428221212716",null,30,{"$nulls":3},"VACANTE",{"$nulls":5},"PÚBLICA","SECUNDARIA","HAMPATURA","CONTRATADO","ACTIVO","ORGÁNICA"]
[null,null,"Prof. x Horas","Ley N° 29944",null,"Gest. Pedg.",null,"08EV01717160",null,"40 CRONOL.",{"$nulls":3},"YANQUE SALINAS, MARIBEL","23920581","EDUCACIÓN PARA EL TRABAJO",3,null,null,"PÚBLICA","SECUNDARIA","LIBERTADOR TÚPAC AMARU","DESIGNADO","ACTIVO","ORGÁNICA"]
[null,null,"Prof. x Horas","Ley N° 29944",null,"Gest. Pedg.",null,"426241219716",null,30,{"$nulls":3},"CONDORI NINA, DOMINGO ELEUTERIO",24581057,"COMUNICACIÓN",2,null,null,"PÚBLICA","SECUNDARIA","LIBERTADOR TÚPAC AMARU","NOMBRADO","ACTIVO","ORGÁNICA"]
[null,null,"Prof. x Horas","Ley N° 29944",null,"Gest. Pedg.",null,"426241219717",null,30,{"$nulls":3},"ORTEGA FRANCO, MARITZA CLOTILDE",{"v":1210133,"d":"01210133"},"EDUCACIÓN PARA EL TRABAJO",1,null,null,"PÚBLICA","SECUNDARIA","LIBERTADOR TÚPAC AMARU","NOMBRADO","ACTIVO","ORGÁNICA"]
[null,null,"Prof. x Horas","Ley N° 29944",null,"Gest. Pedg.",null,"426241219710",null,30,{"$nulls":3},"VACANTE",{"$nulls":5},"PÚBLICA","SECUNDARIA","LIBERTADOR TÚPAC AMARU","CONTRATADO","ACTIVO","ORGÁNICA"]
[null,null,"Prof. x Horas","Ley N° 29944",null,"Gest. Pedg.",null,"426241219711",null,30,{"$nulls":3},"VACANTE",{"$nulls":5},"PÚBLICA","SECUNDARIA","LIBERTADOR TÚPAC AMARU","CONTRATADO","ACTIVO","ORGÁNICA"]
[null,null,"Prof. x Horas","Ley N° 29944",null,"Gest. Pedg.",null,"426241219713",null,30,{"$nulls":3},"VACANTE",{"$nulls":5},"PÚBLICA","SECUNDARIA","LIBERTADOR TÚPAC AMARU","CONTRATADO","ACTIVO","ORGÁNICA"]
[null,null,"Prof. x Horas","Ley N° 29944",null,"Gest. Pedg.",null,"426241219715",null,30,{"$nulls":3},"VACANTE",{"$nulls":5},"PÚBLICA","SECUNDARIA","LIBERTADOR TÚPAC AMARU","CONTRATADO","ACTIVO","ORGÁNICA"]
[null,null,"Prof. x Horas","Ley N° 29944",null,"Gest. Pedg.",null,"426241219719",null,30,{"$nulls":3},"VACANTE",{"$nulls":5},"PÚBLICA","SECUNDARIA","LIBERTADOR TÚPAC AMARU","CONTRATADO","ACTIVO","ORGÁNICA"]
[null,null,"Prof. x Horas","Ley N° 29944",null,"Gest. Inst.",null,"428291212714",null,"40 CRONOL.",{"$nulls":3},"VACANTE",{"$nulls":5},"PÚBLICA","SECUNDARIA","SEÑOR DE EXALTACIÓN","ENCARGATURA","ACTIVO","ORGÁNICA"]
[null,null,"Jefe Laboratorio","Ley N° 29944",null,"Gest. Pedg.",null,"426221215713",null,40,{"$nulls":3},"VACANTE",{"$nulls":5},"PÚBLICA","SECUNDARIA","SEÑOR DE EXALTACIÓN","ENCARGATURA","ACTIVO","ORGÁNICA"]
[null,null,"Prof. AIP","Ley N° 29945",null,"Gest. Pedg.",{"$nulls":3},30,{"$nulls":3},"VACANTE",{"$nulls":5},"PÚBLICA","SECUNDARIA","SEÑOR DE EXALTACIÓN","CONTRATADO","ACTIVO","ORGÁNICA"]
[null,null,"Prof. x Horas","Ley N° 29944",null,"Gest. Pedg.",null,"428261212715",null,30,{"$nulls":3},"COELLO MAYTA, VALERIANO","24706358","EDUCACIÓN FÍSICA",3,null,null,"PÚBLICA","SECUNDARIA","SEÑOR DE EXALTACIÓN","NOMBRADO","ACTIVO","ORGÁNICA"]
[null,null,"Prof. x Horas","Ley N° 29944",null,"Gest. Pedg.",null,"428261212713",null,30,{"$nulls":3},"CHOQUEHUAYTA CONDORI, GRACIANO VICTOR","02292512",null,2,null,null,"PÚBLICA","SECUNDARIA","SEÑOR DE EXALTACIÓN","NOMBRADO","ACTIVO","ORGÁNICA"]
[null,null,"Prof. x Horas","Ley N° 29944",null,"Gest. Pedg.",null,"428261212714",null,30,{"$nulls":3},"CONDORI MAMANI, LAURA","41983999",null,2,null,null,"PÚBLICA","SECUNDARIA","SEÑOR DE EXALTACIÓN","NOMBRADO","ACTIVO","ORGÁNICA"]
[null,null,"Prof. x Horas","Ley N° 29944",null,"Gest. Pedg.",null,"428261212717",null,30,{"$nulls":3},"BARRETO ORTIZ, ANGEL EDGARDO","23853785","COMUNICACIÓN",2,null,null,"PÚBLICA","SECUNDARIA","SEÑOR DE EXALTACIÓN","NOMBRADO","ACTIVO","ORGÁNICA"]
[null,null,"Prof. x Horas","Ley N° 29944",null,"Gest. Pedg.",null,"428291212715",null,30,{"$nulls":3},"MAQQUE QUISPE, MICAELA","24718553","MATEMÁTICA",2,null,null,"PÚBLICA","SECUNDARIA","SEÑOR DE EXALTACIÓN","NOMBRADO","ACTIVO","ORGÁNICA"]
[null,null,"Prof. x Horas","Ley N° 29944",null,"Gest. Pedg.",null,"428261212719",null,30,{"$nulls":3},"AYMACHOQUE ALVARADO, DINO","44386486","MATEMÁTICA",1,null,null,"PÚBLICA","SECUNDARIA","SEÑOR DE EXALTACIÓN","NOMBRADO","ACTIVO","ORGÁNICA"]
[null,null,"Prof. x Horas","Ley N° 29944",null,"Gest. Pedg.",null,"428291212711",null,30,{"$nulls":3},"CALDERON HUANACUNI, EDWIN CESAR","01334031","CIENCIAS SOCIALES",1,null,null,"PÚBLICA","SECUNDARIA","SEÑOR DE EXALTACIÓN","NOMBRADO","ACTIVO","ORGÁNICA"]
[null,null,"Prof. x Horas","Ley N° 29944",null,"Gest. Pedg.",null,"426201211712",null,30,{"$nulls":3},"VACANTE",{"$nulls":5},"PÚBLICA","SECUNDARIA","SEÑOR DE EXALTACIÓN","CONTRATADO","ACTIVO","ORGÁNICA"]
[null,null,"Prof. x Horas","Ley N° 29944",null,"Gest. Pedg.",null,"428261212710",null,30,{"$nulls":3},"VACANTE",{"$nulls":5},"PÚBLICA","SECUNDARIA","SEÑOR DE EXALTACIÓN","CONTRATADO","ACTIVO","ORGÁNICA"]
[null,null,"Prof. x Horas","Ley N° 29944",null,"Gest. Pedg.",null,"428261212711",null,30,{"$nulls":3},"VACANTE",{"$nulls":5},"PÚBLICA","SECUNDARIA","SEÑOR DE EXALTACIÓN","CONTRATADO","ACTIVO","ORGÁNICA"]
[null,null,"Prof. x Horas","Ley N° 29944",null,"Gest. Pedg.",null,"428261212716",null,30,{"$nulls":3},"VACANTE",{"$nulls":5},"PÚBLICA","SECUNDARIA","SEÑOR DE EXALTACIÓN","CONTRATADO","ACTIVO","ORGÁNICA"]
[null,null,"Prof. x Horas","Ley N° 29944",null,"Gest. Pedg.",null,"428291212712",null,30,{"$nulls":3},"VACANTE",{"$nulls":5},"PÚBLICA","SECUNDARIA","SEÑOR DE EXALTACIÓN","CONTRATADO","ACTIVO","ORGÁNICA"]
[null,null,"Director(a)","Ley N° 29944",null,"Gest. Inst.",null,"428211212717",null,"40 CRONOL.",{"$nulls":3},"CCOTO TACUSI, TEOFILO FORTUNATO","24583014","MATEMÁTICA",4,null,null,"PÚBLICA","SECUNDARIA","JOSE GABRIEL CONDORCANQUI","DESIGNADO","ACTIVO","ORGÁNICA"]
[null,null,"Sub Director(a)","Ley N° 29944",null,"Gest. Inst.",null,"08EV01717161",null,"40 CRONOL.",{"$nulls":3},"AGUILAR MONTUFAR, RUDY","41325118","COMUNICACIÓN",3,null,null,"PÚBLICA","SECUNDARIA","JOSE GABRIEL CONDORCANQUI","DESIGNADO","ACTIVO","ORGÁNICA"]
[null,null,"Jefe Laboratorio","Ley N° 29944",null,"Gest. Pedg.",null,"428231214719",null,40,{"$nulls":3},"VACANTE",{"$nulls":5},"PÚBLICA","SECUNDARIA","JOSE GABRIEL CONDORCANQUI","ENCARGATURA","ACTIVO","ORGÁNICA"]
[null,null,"Prof. x Horas","Ley N° 29944",null,"Gest. Pedg.",null,"428211212712",null,30,{"$nulls":3},"BERRIOS CADENA, JOSE LUIS","40141046","CIENCIAS SOCIALES",3,null,null,"PÚBLICA","SECUNDARIA","JOSE GABRIEL CONDORCANQUI","NOMBRADO","ACTIVO","ORGÁNICA"]
[null,null,"Prof. x Horas","Ley N° 29944",null,"Gest. Pedg.",null,"428231214717",null,30,{"$nulls":3},"HUACASI MAMANI, ESTHER","40659964","MATEMÁTICA",3,null,null,"PÚBLICA","SECUNDARIA","JOSE GABRIEL CONDORCANQUI","NOMBRADO","ACTIVO","ORGÁNICA"]
[null,null,"Prof. x Horas","Ley N° 29944",null,"Gest. Pedg.",null,"428241212713",null,30,{"$nulls":3},"LIMO CUYTO, JUANA MARINA","23862886","COMUNICACIÓN",3,null,null,"PÚBLICA","SECUNDARIA","JOSE GABRIEL CONDORCANQUI","NOMBRADO","ACTIVO","ORGÁNICA"]
[null,null,"Prof. x Horas","Ley N° 29944",null,"Gest. Pedg.",null,"428251214713",null,30,{"$nulls":3},"CUEVA ESTRADA, MISAEL","23951580",null,3,null,null,"PÚBLICA","SECUNDARIA","JOSE GABRIEL CONDORCANQUI","NOMBRADO","ACTIVO","ORGÁNICA"]
[null,null,"Prof. x Horas","Ley N° 29944",null,"Gest. Pedg.",null,"428211212710",null,30,{"$nulls":3},"MAMANI QUISPE, SANTOS RUBEN","24709898","CIENCIA Y TECNOLOGIA",2,null,null,"PÚBLICA","SECUNDARIA","JOSE GABRIEL CONDORCANQUI","NOMBRADO","ACTIVO","ORGÁNICA"]
[null,null,"Prof. x Horas","Ley N° 29944",null,"Gest. Pedg.",null,"428211212715",null,30,{"$nulls":3},"ARQQUE FERNANDEZ, MARIO","24564126",null,2,null,null,"PÚBLICA","SECUNDARIA","JOSE GABRIEL CONDORCANQUI","NOMBRADO","ACTIVO","ORGÁNICA"]
[null,null,"Prof. x Horas","Ley N° 29944",null,"Gest. Pedg.",null,"428211212716",null,30,{"$nulls":3},"CHAVEZ LAZO, GABINA LOURDES","29409119","MATEMÁTICA",2,null,null,"PÚBLICA","SECUNDARIA","JOSE GABRIEL CONDORCANQUI","NOMBRADO","ACTIVO","ORGÁNICA"]
[null,null,"Prof. x Horas","Ley N° 29944",null,"Gest. Pedg.",null,"428231214711",null,30,{"$nulls":3},"PUMA LEON, MARGOT ALICIA","24721823","COMUNICACIÓN",2,null,null,"PÚBLICA","SECUNDARIA","JOSE GABRIEL CONDORCANQUI","NOMBRADO","ACTIVO","ORGÁNICA"]
[null,null,"Prof. x Horas","Ley N° 29944",null,"Gest. Pedg.",null,"428231214712",null,30,{"$nulls":3},"SEGURA FLORES, VERONICA GRISELDA","41066513","CIENCIAS SOCIALES",2,null,null,"PÚBLICA","SECUNDARIA","JOSE GABRIEL CONDORCANQUI","NOMBRADO","ACTIVO","ORGÁNICA"]
[null,null,"Prof. x Horas","Ley N° 29944",null,"Gest. Pedg.",null,"428231214715",null,30,{"$nulls":3},"GAYONA CALLO, ROMUALDO","24564680","EDUCACIÓN FÍSICA",2,null,null,"PÚBLICA","SECUNDARIA","JOSE GABRIEL CONDORCANQUI","NOMBRADO","ACTIVO","ORGÁNICA"]
[null,null,"Prof. x Horas","Ley N° 29944",null,"Gest. Pedg.",null,"428251214714",null,30,{"$nulls":3},"LAROTA ILAHUALA, COSME DAMIAN","24560841",null,2,null,null,"PÚBLICA","SECUNDARIA","JOSE GABRIEL CONDORCANQUI","NOMBRADO","ACTIVO","ORGÁNICA"]
[null,null,"Prof. x Horas","Ley N° 29944",null,"Gest. Pedg.",null,"428211212711",null,30,{"$nulls":3},"ESCOBAR CHOQQUE, FRANCISCO","24560517","CIENCIAS SOCIALES",1,null,null,"PÚBLICA","SECUNDARIA","JOSE GABRIEL CONDORCANQUI","NOMBRADO","ACTIVO","ORGÁNICA"]
[null,null,"Prof. x Horas","Ley N° 29944",null,"Gest. Pedg.",null,"428211212718",null,30,{"$nulls":3},"NINA CASCAMAITA, PASCUALA","23843305",null,1,null,null,"PÚBLICA","SECUNDARIA","JOSE GABRIEL CONDORCANQUI","NOMBRADO","ACTIVO","ORGÁNICA"]
[null,null,"Prof. x Horas","Ley N° 29944",null,"Gest. Pedg.",null,"428231214713",null,30,{"$nulls":3},"LAROTA SARAVIA, JUSTO","24564557",null,1,null,null,"PÚBLICA","SECUNDARIA","JOSE GABRIEL CONDORCANQUI","NOMBRADO","ACTIVO","ORGÁNICA"]
[null,null,"Prof. x Horas","Ley N° 29944",null,"Gest. Pedg.",null,"428241212719",null,30,{"$nulls":3},"TICONA CHOQUE, LIZ VERONICA","41401940","COMUNICACIÓN",1,null,null,"PÚBLICA","SECUNDARIA","JOSE GABRIEL CONDORCANQUI","NOMBRADO","ACTIVO","ORGÁNICA"]
[null,null,"Prof. x Horas","Ley N° 29944",null,"Gest. Pedg.",null,"428251214710",null,30,{"$nulls":3},"LEON APAZA, FREDY","42596440",null,1,null,null,"PÚBLICA","SECUNDARIA","JOSE GABRIEL CONDORCANQUI","NOMBRADO","ACTIVO","ORGÁNICA"]
[null,null,"Prof. x Horas","Ley N° 29944",null,"Gest. Pedg.",null,"428251214718",null,30,{"$nulls":3},"HUAICHO SOTELO, ALAN ALFREDO","29593637",null,1,null,null,"PÚBLICA","SECUNDARIA","JOSE GABRIEL CONDORCANQUI","NOMBRADO","ACTIVO","ORGÁNICA"]
[null,null,"Prof. x Horas","Ley N° 29944",null,"Gest. Pedg.",null,"426221211717",null,30,{"$nulls":3},"VACANTE",{"$nulls":5},"PÚBLICA","SECUNDARIA","JOSE GABRIEL CONDORCANQUI","CONTRATADO","ACTIVO","ORGÁNICA"]
[null,null,"Prof. x Horas","Ley N° 29944",null,"Gest. Pedg.",null,"428211212713",null,30,{"$nulls":3},"VACANTE",{"$nulls":5},"PÚBLICA","SECUNDARIA","JOSE GABRIEL CONDORCANQUI","CONTRATADO","ACTIVO","ORGÁNICA"]
[null,null,"Prof. x Horas","Ley N° 29944",null,"Gest. Pedg.",null,"428211212714",null,30,{"$nulls":3},"VACANTE",{"$nulls":5},"PÚBLICA","SECUNDARIA","JOSE GABRIEL CONDORCANQUI","CONTRATADO","ACTIVO","ORGÁNICA"]
[null,null,"Prof. x Horas","Ley N° 29944",null,"Gest. Pedg.",null,"428231214710",null,30,{"$nulls":3},"VACANTE",{"$nulls":5},"PÚBLICA","SECUNDARIA","JOSE GABRIEL CONDORCANQUI","CONTRATADO","ACTIVO","ORGÁNICA"]
[null,null,"Prof. x Horas","Ley N° 29944",null,"Gest. Pedg.",null,"428231214716",null,30,{"$nulls":3},"VACANTE",{"$nulls":5},"PÚBLICA","SECUNDARIA","JOSE GABRIEL CONDORCANQUI","CONTRATADO","ACTIVO","ORGÁNICA"]
[null,null,"Prof. x Horas","Ley N° 29944",null,"Gest. Pedg.",null,"428231214718",null,30,{"$nulls":3},"VACANTE",{"$nulls":5},"PÚBLICA","SECUNDARIA","JOSE GABRIEL CONDORCANQUI","CONTRATADO","ACTIVO","ORGÁNICA"]
[null,null,"Prof. x Horas","Ley N° 29944",null,"Gest. Pedg.",null,"428241212712",null,30,{"$nulls":3},"VACANTE",{"$nulls":5},"PÚBLICA","SECUNDARIA","JOSE GABRIEL CONDORCANQUI","CONTRATADO","ACTIVO","ORGÁNICA"]
[null,null,"Prof. x Horas","Ley N° 29944",null,"Gest. Pedg.",null,"428251214711",null,30,{"$nulls":3},"VACANTE",{"$nulls":5},"PÚBLICA","SECUNDARIA","JOSE GABRIEL CONDORCANQUI","CONTRATADO","ACTIVO","ORGÁNICA"]
[null,null,"Prof. x Horas","Ley N° 29944",null,"Gest. Pedg.",null,"428251214712",null,30,{"$nulls":3},"VACANTE",{"$nulls":5},"PÚBLICA","SECUNDARIA","JOSE GABRIEL CONDORCANQUI","CONTRATADO","ACTIVO","ORGÁNICA"]
[null,null,"Prof. x Horas","Ley N° 29944",null,"Gest. Pedg.",null,"428251214716",null,30,{"$nulls":3},"VACANTE",{"$nulls":5},"PÚBLICA","SECUNDARIA","JOSE GABRIEL CONDORCANQUI","CONTRATADO","ACTIVO","ORGÁNICA"]
[null,null,"Prof. x Horas","Ley N° 29944",null,"Gest. Pedg.",null,"428251214717",null,30,{"$nulls":3},"VACANTE",{"$nulls":5},"PÚBLICA","SECUNDARIA","JOSE GABRIEL CONDORCANQUI","CONTRATADO","ACTIVO","ORGÁNICA"]
[null,null,"Prof. x Horas","Ley N° 29944",null,"Gest. Pedg.",null,"428251214719",null,30,{"$nulls":3},"VACANTE",{"$nulls":5},"PÚBLICA","SECUNDARIA","JOSE GABRIEL CONDORCANQUI","CONTRATADO","ACTIVO","ORGÁNICA"]
[null,null,"Director(a)","Ley N° 29944",null,"Gest. Inst.",null,"08EV01623689",null,"40 CRONOL.",{"$nulls":3},"DELGADO ARTEAGA, JAIME","24710613","MATEMÁTICA",4,null,null,"PÚBLICA","SECUNDARIA","INDEPENDENCIA AMERICANA","DESIGNADO","ACTIVO","ORGÁNICA"]
[null,null,"Sub Director(a)","Ley N° 29945",null,"Gest. Inst.",{"$nulls":3},"40 CRONOL.",{"$nulls":3},"VACANTE",{"$nulls":5},"PÚBLICA","SECUNDARIA","INDEPENDENCIA AMERICANA","ENCARGATURA","ACTIVO","ORGÁNICA"]
[null,null,"Jefe Laboratorio","Ley N° 29944",null,"Gest. Pedg.",null,"426201219710",null,40,{"$nulls":3},"VACANTE",{"$nulls":5},"PÚBLICA","SECUNDARIA","INDEPENDENCIA AMERICANA","ENCARGATURA","ACTIVO","ORGÁNICA"]
[null,null,"Prof. AIP","Ley N° 29945",null,"Gest. Pedg.",{"$nulls":3},30,{"$nulls":3},"VACANTE",{"$nulls":5},"PÚBLICA","SECUNDARIA","INDEPENDENCIA AMERICANA","CONTRATADO","ACTIVO","ORGÁNICA"]
[null,null,"Prof. x Horas","Ley N° 29944",null,"Gest. Pedg.",null,"426221211710",null,30,{"$nulls":3},"CONDORI CUTIPA, NEPTALI","40292936",null,3,null,null,"PÚBLICA","SECUNDARIA","INDEPENDENCIA AMERICANA","NOMBRADO","ACTIVO","ORGÁNICA"]
[null,null,"Prof. x Horas","Ley N° 29944",null,"Gest. Pedg.",null,"428271212714",null,30,{"$nulls":3},"ARQQUE LINARES, LUCIO","24560607","CIENCIAS SOCIALES",3,null,null,"PÚBLICA","SECUNDARIA","INDEPENDENCIA AMERICANA","NOMBRADO","ACTIVO","ORGÁNICA"]
[null,null,"Prof. x Horas","Ley N° 29944",null,"Gest. Pedg.",null,"428271212716",null,30,{"$nulls":3},"DOLORIER DE LA CRUZ, JOHN WALTER ANTONIO","09042253","COMUNICACIÓN",3,null,null,"PÚBLICA","SECUNDARIA","INDEPENDENCIA AMERICANA","NOMBRADO","ACTIVO","ORGÁNICA"]
[null,null,"Prof. x Horas","Ley N° 29944",null,"Gest. Pedg.",null,"428291212710",null,30,{"$nulls":3},"JAQQUEHUA CCALLOQUISPE, RICARDO MAXIMO","24565088","COMUNICACIÓN",3,null,null,"PÚBLICA","SECUNDARIA","INDEPENDENCIA AMERICANA","NOMBRADO","ACTIVO","ORGÁNICA"]
[null,null,"Prof. x Horas","Ley N° 29944",null,"Gest. Pedg.",null,"428291212719",null,30,{"$nulls":3},"QUISPE FUENTES, DELIA","24714922",null,3,null,null,"PÚBLICA","SECUNDARIA","INDEPENDENCIA AMERICANA","NOMBRADO","ACTIVO","ORGÁNICA"]
[null,null,"Prof. x Horas","Ley N° 29944",null,"Gest. Pedg.",null,"426221211713",null,30,{"$nulls":3},"MELENDEZ ARCE, ARMANDO","23856451","COMUNICACIÓN",2,null,null,"PÚBLICA","SECUNDARIA","INDEPENDENCIA AMERICANA","NOMBRADO","ACTIVO","ORGÁNICA"]
[null,null,"Prof. x Horas","Ley N° 29944",null,"Gest. Pedg.",null,"426221211719",null,30,{"$nulls":3},"VILLANUEVA MAMANI, WILY GERMAN","40706302","CIENCIAS SOCIALES",1,null,null,"PÚBLICA","SECUNDARIA","INDEPENDENCIA AMERICANA","NOMBRADO","ACTIVO","ORGÁNICA"]
[null,null,"Prof. x Horas","Ley N° 29944",null,"Gest. Pedg.",null,"428221212712",null,30,{"$nulls":3},"CORTEZ PUMA, ILICH DAVID","43645373","MATEMÁTICA",1,null,null,"PÚBLICA","SECUNDARIA","INDEPENDENCIA AMERICANA","NOMBRADO","ACTIVO","ORGÁNICA"]
[null,null,"Prof. x Horas","Ley N° 29944",null,"Gest. Pedg.",null,"428291212716",null,30,{"$nulls":3},"VILLAVICENCIO CALLO, EMIL","23957486","COMUNICACIÓN",1,null,null,"PÚBLICA","SECUNDARIA","INDEPENDENCIA AMERICANA","NOMBRADO","ACTIVO","ORGÁNICA"]
[null,null,"Prof. x Horas","Ley N° 29944",null,"Gest. Pedg.",null,"426221211716",null,30,{"$nulls":3},"VACANTE",{"$nulls":5},"PÚBLICA","SECUNDARIA","INDEPENDENCIA AMERICANA","CONTRATADO","ACTIVO","ORGÁNICA"]
[null,null,"Prof. x Horas","Ley N° 29944",null,"Gest. Pedg.",null,"428221212714",null,30,{"$nulls":3},"VACANTE",{"$nulls":5},"PÚBLICA","SECUNDARIA","INDEPENDENCIA AMERICANA","CONTRATADO","ACTIVO","ORGÁNICA"]
[null,null,"Prof. x Horas","Ley N° 29944",null,"Gest. Pedg.",null,"428221212718",null,30,{"$nulls":3},"VACANTE",{"$nulls":5},"PÚBLICA","SECUNDARIA","INDEPENDENCIA AMERICANA","CONTRATADO","ACTIVO","ORGÁNICA"]
[null,null,"Prof. x Horas","Ley N° 29944",null,"Gest. Pedg.",null,"428271212710",null,30,{"$nulls":3},"VACANTE",{"$nulls":5},"PÚBLICA","SECUNDARIA","INDEPENDENCIA AMERICANA","CONTRATADO","ACTIVO","ORGÁNICA"]
[null,null,"Prof. x Horas","Ley N° 29944",null,"Gest. Pedg.",null,"428271212711",null,30,{"$nulls":3},"VACANTE",{"$nulls":5},"PÚBLICA","SECUNDARIA","INDEPENDENCIA AMERICANA","CONTRATADO","ACTIVO","ORGÁNICA"]
[null,null,"Prof. x Horas","Ley N° 29944",null,"Gest. Pedg.",null,"428271212712",null,30,{"$nulls":3},"VACANTE",{"$nulls":5},"PÚBLICA","SECUNDARIA","INDEPENDENCIA AMERICANA","CONTRATADO","ACTIVO","ORGÁNICA"]
[null,null,"Prof. x Horas","Ley N° 29944",null,"Gest. Pedg.",null,"428271212715",null,30,{"$nulls":3},"VACANTE",{"$nulls":5},"PÚBLICA","SECUNDARIA","INDEPENDENCIA AMERICANA","CONTRATADO","ACTIVO","ORGÁNICA"]
[null,null,"Prof. x Horas","Ley N° 29944",null,"Gest. Pedg.",null,"428271212718",null,30,{"$nulls":3},"VACANTE",{"$nulls":5},"PÚBLICA","SECUNDARIA","INDEPENDENCIA AMERICANA","CONTRATADO","ACTIVO","ORGÁNICA"]
[null,null,"Prof. x Horas","Ley N° 29944",null,"Gest. Pedg.",null,"428291212717",null,30,{"$nulls":3},"VACANTE",{"$nulls":5},"PÚBLICA","SECUNDARIA","INDEPENDENCIA AMERICANA","CONTRATADO","ACTIVO","ORGÁNICA"]
[null,null,"Sub Director(a)","Ley N° 29944",null,"Gest. Inst.",null,"428281212719",null,"40 CRONOL.",{"$nulls":3},"VACANTE",{"$nulls":5},"PÚBLICA","CEBA","CEBA - JOSÉ GABRIEL CONDORCANQUI","ENCARGATURA","ACTIVO","ORGÁNICA"]
[null,null,"Prof. x Horas","Ley N° 29944",null,"Gest. Pedg.",null,"428281212710",null,30,{"$nulls":3},"SALAS MERCADO, REINALDO MATEO","24582060",null,"3",null,null,"PÚBLICA","CEBA","CEBA - JOSÉ GABRIEL CONDORCANQUI","NOMBRADO","ACTIVO","ORGÁNICA"]
[null,null,"Prof. x Horas","Ley N° 29944",null,"Gest. Pedg.",null,"428281212715",null,30,{"$nulls":3},"APAZA TACO, JUAN BAUTISTA","24560320",null,"2",null,null,"PÚBLICA","CEBA","CEBA - JOSÉ GABRIEL CONDORCANQUI","NOMBRADO","ACTIVO","ORGÁNICA"]
[null,null,"Prof. x Horas","Ley N° 29944",null,"Gest. Pedg.",null,"428281212711",null,30,{"$nulls":3},"ARQQUE LINARES, HIPOLITO","24576454",null,"1",null,null,"PÚBLICA","CEBA","CEBA - JOSÉ GABRIEL CONDORCANQUI","NOMBRADO","ACTIVO","ORGÁNICA"]
[null,null,"Prof. x Horas","Ley N° 29944",null,"Gest. Pedg.",null,"428281212714",null,30,{"$nulls":3},"APAZA CHOQQUE, ERNESTO","24561188",null,"1",null,null,"PÚBLICA","CEBA","CEBA - JOSÉ GABRIEL CONDORCANQUI","NOMBRADO","ACTIVO","ORGÁNICA"]

{"sheet":"PRINT","index":11,"n_rows":0,"n_cols":0,"rows_kept":0,"hidden":true}

{"sheet":"LISTAS","index":12,"n_rows":47,"n_cols":39,"rows_kept":47,"hidden":true,"merged":[[24,3,24,4],[25,3,25,4],[26,3,26,4],[27,3,27,4],[28,3,28,4],[29,3,29,4],[30,3,30,4],[31,3,31,4],[32,3,32,4],[33,3,33,4],[34,3,34,4],[35,3,35,4],[36,3,36,4],[37,3,37,4],[38,3,38,4],[39,3,39,4],[40,3,40,4],[41,3,41,4],[42,3,42,4],[43,3,43,4],[44,3,44,4],[45,3,45,4],[46,3,46,4],[47,3,47,4],[48,3,48,4],[49,3,49,4],[50,3,50,4],[51,3,51,4],[52,3,52,4],[53,3,53,4],[54,3,54,4],[55,3,55,4],[56,3,56,4],[57,3,57,4],[58,3,58,4],[59,3,59,4],[60,3,60,4],[61,3,61,4],[62,3,62,4],[63,3,63,4],[64,3,64,4],[65,3,65,4],[66,3,66,4],[67,3,67,4],[68,3,68,4],[69,3,69,4],[70,3,70,4],[71,3,71,4],[72,3,72,4],[73,3,73,4],[74,3,74,4],[75,3,75,4],[76,3,76,4],[77,3,77,4],[78,3,78,4],[79,3,79,4],[80,3,80,4],[81,3,81,4],[82,3,82,4],[83,3,83,4],[84,3,84,4],[85,3,85,4],[86,3,86,4],[87,3,87,4],[88,3,88,4],[89,3,89,4],[90,3,90,4],[91,3,91,4],[92,3,92,4],[93,3,93,4],[94,3,94,4],[95,3,95,4],[96,3,96,4],[97,3,97,4],[98,3,98,4],[99,3,99,4],[100,3,100,4],[101,3,101,4],[102,3,102,4],[103,3,103,4],[104,3,104,4],[105,3,105,4],[106,3,106,4],[107,3,107,4],[108,3,108,4],[109,3,109,4],[110,3,110,4],[111,3,111,4],[112,3,112,4],[113,3,113,4],[114,3,114,4],[115,3,115,4],[116,3,116,4],[117,3,117,4],[118,3,118,4],[119,3,119,4],[120,3,120,4],[121,3,121,4],[122,3,122,4],[123,3,123,4],[124,3,124,4],[125,3,125,4],[126,3,126,4],[127,3,127,4],[128,3,128,4],[129,3,129,4],[130,3,130,4],[131,3,131,4],[132,3,132,4],[133,3,133,4],[134,3,134,4],[135,3,135,4],[136,3,136,4],[137,3,137,4],[138,3,138,4],[139,3,139,4],[140,3,140,4],[141,3,141,4],[142,3,142,4],[143,3,143,4],[144,3,144,4],[145,3,145,4],[146,3,146,4],[147,3,147,4],[148,3,148,4],[149,3,149,4],[150,3,150,4],[151,3,151,4],[152,3,152,4],[153,3,153,4],[154,3,154,4],[155,3,155,4],[156,3,156,4],[157,3,157,4],[158,3,158,4],[159,3,159,4],[160,3,160,4],[161,3,161,4],[162,3,162,4],[163,3,163,4],[164,3,164,4],[165,3,165,4],[166,3,166,4],[167,3,167,4],[168,3,168,4],[169,3,169,4],[170,3,170,4],[171,3,171,4],[172,3,172,4],[173,3,173,4],[174,3,174,4],[175,3,175,4],[176,3,176,4],[177,3,177,4],[178,3,178,4],[179,3,179,4],[180,3,180,4],[181,3,181,4],[182,3,182,4],[183,3,183,4],[184,3,184,4],[185,3,185,4],[186,3,186,4],[187,3,187,4],[188,3,188,4],[189,3,189,4],[190,3,190,4],[191,3,191,4],[192,3,192,4],[193,3,193,4],[194,3,194,4],[195,3,195,4],[196,3,196,4],[197,3,197,4],[198,3,198,4],[199,3,199,4],[200,3,200,4],[201,3,201,4],[202,3,202,4],[203,3,203,4],[204,3,204,4],[205,3,205,4],[206,3,206,4],[207,3,207,4],[208,3,208,4],[209,3,209,4],[210,3,210,4],[211,3,211,4],[212,3,212,4],[213,3,213,4],[214,3,214,4],[215,3,215,4],[216,3,216,4],[217,3,217,4],[218,3,218,4],[219,3,219,4],[220,3,220,4],[221,3,221,4],[222,3,222,4],[223,3,223,4],[224,3,224,4],[225,3,225,4],[226,3,226,4],[227,3,227,4],[228,3,228,4],[229,3,229,4],[230,3,230,4],[231,3,231,4],[232,3,232,4],[233,3,233,4],[234,3,234,4],[235,3,235,4],[236,3,236,4],[237,3,237,4],[238,3,238,4],[239,3,239,4],[240,3,240,4],[241,3,241,4],[242,3,242,4],[243,3,243,4],[244,3,244,4],[245,3,245,4],[246,3,246,4],[247,3,247,4],[248,3,248,4],[249,3,249,4],[250,3,250,4],[251,3,251,4],[252,3,252,4],[253,3,253,4],[254,3,254,4],[255,3,255,4],[256,3,256,4],[257,3,257,4],[258,3,258,4],[259,3,259,4],[260,3,260,4],[261,3,261,4],[262,3,262,4],[263,3,263,4],[264,3,264,4],[265,3,265,4],[266,3,266,4],[267,3,267,4],[268,3,268,4],[269,3,269,4],[270,3,270,4],[271,3,271,4],[272,3,272,4],[273,3,273,4],[274,3,274,4],[275,3,275,4],[276,3,276,4],[277,3,277,4],[278,3,278,4],[279,3,279,4],[280,3,280,4],[281,3,281,4],[282,3,282,4],[283,3,283,4],[284,3,284,4],[285,3,285,4],[286,3,286,4],[287,3,287,4],[288,3,288,4],[289,3,289,4],[290,3,290,4],[291,3,291,4],[292,3,292,4],[293,3,293,4],[294,3,294,4],[295,3,295,4],[296,3,296,4],[297,3,297,4],[298,3,298,4],[299,3,299,4],[300,3,300,4],[301,3,301,4],[302,3,302,4],[303,3,303,4],[304,3,304,4],[305,3,305,4],[306,3,306,4],[307,3,307,4],[308,3,308,4],[309,3,309,4],[310,3,310,4],[311,3,311,4],[312,3,312,4],[313,3,313,4],[314,3,314,4],[315,3,315,4],[316,3,316,4],[317,3,317,4],[318,3,318,4],[319,3,319,4],[320,3,320,4],[321,3,321,4],[322,3,322,4],[323,3,323,4],[324,3,324,4],[325,3,325,4],[326,3,326,4],[327,3,327,4],[328,3,328,4],[329,3,329,4],[330,3,330,4],[331,3,331,4],[332,3,332,4],[333,3,333,4],[334,3,334,4],[335,3,335,4],[336,3,336,4],[337,3,337,4],[338,3,338,4],[339,3,339,4],[340,3,340,4],[341,3,341,4],[342,3,342,4],[343,3,343,4],[344,3,344,4],[345,3,345,4],[346,3,346,4],[347,3,347,4],[348,3,348,4],[349,3,349,4],[350,3,350,4],[351,3,351,4],[352,3,352,4],[353,3,353,4],[354,3,354,4],[355,3,355,4],[356,3,356,4],[357,3,357,4],[358,3,358,4],[359,3,359,4],[360,3,360,4],[361,3,361,4],[362,3,362,4],[363,3,363,4],[364,3,364,4],[365,3,365,4],[366,3,366,4],[367,3,367,4],[368,3,368,4],[369,3,369,4],[370,3,370,4],[371,3,371,4],[372,3,372,4],[373,3,373,4],[374,3,374,4],[375,3,375,4],[376,3,376,4],[377,3,377,4],[378,3,378,4],[379,3,379,4],[380,3,380,4],[381,3,381,4],[382,3,382,4],[383,3,383,4],[384,3,384,4],[385,3,385,4],[386,3,386,4],[387,3,387,4],[388,3,388,4],[389,3,389,4],[390,3,390,4],[391,3,391,4],[392,3,392,4],[393,3,393,4],[394,3,394,4],[395,3,395,4],[396,3,396,4],[397,3,397,4],[398,3,398,4],[399,3,399,4],[400,3,400,4],[401,3,401,4],[402,3,402,4],[403,3,403,4],[404,3,404,4],[405,3,405,4],[406,3,406,4],[407,3,407,4],[408,3,408,4],[409,3,409,4],[410,3,410,4],[411,3,411,4],[412,3,412,4],[413,3,413,4],[414,3,414,4],[415,3,415,4],[416,3,416,4],[417,3,417,4],[418,3,418,4],[419,3,419,4],[420,3,420,4],[421,3,421,4],[422,3,422,4],[423,3,423,4],[424,3,424,4],[425,3,425,4],[426,3,426,4],[427,3,427,4],[428,3,428,4],[429,3,429,4],[430,3,430,4],[431,3,431,4],[432,3,432,4],[433,3,433,4],[434,3,434,4],[435,3,435,4],[436,3,436,4],[437,3,437,4],[438,3,438,4],[439,3,439,4],[440,3,440,4],[441,3,441,4],[442,3,442,4],[443,3,443,4],[444,3,444,4],[445,3,445,4],[446,3,446,4],[447,3,447,4],[448,3,448,4],[449,3,449,4],[450,3,450,4],[451,3,451,4],[452,3,452,4],[453,3,453,4],[454,3,454,4],[455,3,455,4],[456,3,456,4],[457,3,457,4],[458,3,458,4],[459,3,459,4],[460,3,460,4],[461,3,461,4],[462,3,462,4],[463,3,463,4],[464,3,464,4],[465,3,465,4],[466,3,466,4],[467,3,467,4],[468,3,468,4],[469,3,469,4],[470,3,470,4],[471,3,471,4],[472,3,472,4],[473,3,473,4],[474,3,474,4],[475,3,475,4],[476,3,476,4],[477,3,477,4],[478,3,478,4],[479,3,479,4],[480,3,480,4],[481,3,481,4],[482,3,482,4],[483,3,483,4],[484,3,484,4],[485,3,485,4],[486,3,486,4],[487,3,487,4],[488,3,488,4],[489,3,489,4],[490,3,490,4],[491,3,491,4],[492,3,492,4],[493,3,493,4],[494,3,494,4],[495,3,495,4],[496,3,496,4],[497,3,497,4],[498,3,498,4],[499,3,499,4],[500,3,500,4],[501,3,501,4],[502,3,502,4],[503,3,503,4],[504,3,504,4],[505,3,505,4],[506,3,506,4],[507,3,507,4],[508,3,508,4],[509,3,509,4],[510,3,510,4],[511,3,511,4],[512,3,512,4],[513,3,513,4],[514,3,514,4],[515,3,515,4],[516,3,516,4],[517,3,517,4],[518,3,518,4],[519,3,519,4],[520,3,520,4],[521,3,521,4],[522,3,522,4],[523,3,523,4],[524,3,524,4],[525,3,525,4],[526,3,526,4],[527,3,527,4],[528,3,528,4],[529,3,529,4],[530,3,530,4],[531,3,531,4],[532,3,532,4],[533,3,533,4],[534,3,534,4],[535,3,535,4],[536,3,536,4],[537,3,537,4],[538,3,538,4],[539,3,539,4],[540,3,540,4],[541,3,541,4],[542,3,542,4],[543,3,543,4],[544,3,544,4],[545,3,545,4],[546,3,546,4],[547,3,547,4],[548,3,548,4],[549,3,549,4],[550,3,550,4],[551,3,551,4],[552,3,552,4],[553,3,553,4],[554,3,554,4],[555,3,555,4],[556,3,556,4],[557,3,557,4],[558,3,558,4],[559,3,559,4],[560,3,560,4],[561,3,561,4],[562,3,562,4],[563,3,563,4],[564,3,564,4],[565,3,565,4],[566,3,566,4],[567,3,567,4],[568,3,568,4],[569,3,569,4],[570,3,570,4],[571,3,571,4],[572,3,572,4],[573,3,573,4],[574,3,574,4],[575,3,575,4],[576,3,576,4],[577,3,577,4],[578,3,578,4],[579,3,579,4],[580,3,580,4],[581,3,581,4],[582,3,582,4],[583,3,583,4],[584,3,584,4],[585,3,585,4],[586,3,586,4],[587,3,587,4],[588,3,588,4],[589,3,589,4],[590,3,590,4],[591,3,591,4],[592,3,592,4],[593,3,593,4],[594,3,594,4],[595,3,595,4],[596,3,596,4],[597,3,597,4],[598,3,598,4],[599,3,599,4],[600,3,600,4],[601,3,601,4],[602,3,602,4],[603,3,603,4],[604,3,604,4],[605,3,605,4],[606,3,606,4],[607,3,607,4],[608,3,608,4],[609,3,609,4],[610,3,610,4],[611,3,611,4],[612,3,612,4],[613,3,613,4],[614,3,614,4],[615,3,615,4],[616,3,616,4],[617,3,617,4],[618,3,618,4],[619,3,619,4],[620,3,620,4],[621,3,621,4],[622,3,622,4],[623,3,623,4],[624,3,624,4],[625,3,625,4],[626,3,626,4],[627,3,627,4],[628,3,628,4],[629,3,629,4],[630,3,630,4],[631,3,631,4],[632,3,632,4],[633,3,633,4],[634,3,634,4],[635,3,635,4],[636,3,636,4],[637,3,637,4],[638,3,638,4],[639,3,639,4],[640,3,640,4],[641,3,641,4],[642,3,642,4],[643,3,643,4],[644,3,644,4],[645,3,645,4],[646,3,646,4],[647,3,647,4],[648,3,648,4],[649,3,649,4],[650,3,650,4],[651,3,651,4],[652,3,652,4],[653,3,653,4],[654,3,654,4],[655,3,655,4],[656,3,656,4],[657,3,657,4],[658,3,658,4],[659,3,659,4],[660,3,660,4],[661,3,661,4],[662,3,662,4],[663,3,663,4],[664,3,664,4],[665,3,665,4],[666,3,666,4],[667,3,667,4],[668,3,668,4],[669,3,669,4],[670,3,670,4],[671,3,671,4],[672,3,672,4],[673,3,673,4],[674,3,674,4],[675,3,675,4],[676,3,676,4],[677,3,677,4],[678,3,678,4],[679,3,679,4],[680,3,680,4],[681,3,681,4],[682,3,682,4],[683,3,683,4],[684,3,684,4],[685,3,685,4],[686,3,686,4],[687,3,687,4],[688,3,688,4],[689,3,689,4],[690,3,690,4],[691,3,691,4],[692,3,692,4],[693,3,693,4],[694,3,694,4],[695,3,695,4],[696,3,696,4],[697,3,697,4],[698,3,698,4],[699,3,699,4],[700,3,700,4],[701,3,701,4],[702,3,702,4],[703,3,703,4],[704,3,704,4],[705,3,705,4],[706,3,706,4],[707,3,707,4],[708,3,708,4],[709,3,709,4],[710,3,710,4],[711,3,711,4],[712,3,712,4],[713,3,713,4],[714,3,714,4],[715,3,715,4],[716,3,716,4],[717,3,717,4],[718,3,718,4],[719,3,719,4],[720,3,720,4],[721,3,721,4],[722,3,722,4],[723,3,723,4],[724,3,724,4],[725,3,725,4],[726,3,726,4],[727,3,727,4],[728,3,728,4],[729,3,729,4],[730,3,730,4],[731,3,731,4],[732,3,732,4],[733,3,733,4],[734,3,734,4],[735,3,735,4],[736,3,736,4],[737,3,737,4],[738,3,738,4],[739,3,739,4],[740,3,740,4],[741,3,741,4],[742,3,742,4],[743,3,743,4],[744,3,744,4],[745,3,745,4],[746,3,746,4],[747,3,747,4],[748,3,748,4],[749,3,749,4],[750,3,750,4],[751,3,751,4],[752,3,752,4],[753,3,753,4],[754,3,754,4],[755,3,755,4],[756,3,756,4],[757,3,757,4],[758,3,758,4],[759,3,759,4],[760,3,760,4],[761,3,761,4],[762,3,762,4],[763,3,763,4],[764,3,764,4],[765,3,765,4],[766,3,766,4],[767,3,767,4],[768,3,768,4],[769,3,769,4],[770,3,770,4],[771,3,771,4],[772,3,772,4],[773,3,773,4],[774,3,774,4],[775,3,775,4],[776,3,776,4],[777,3,777,4],[778,3,778,4],[779,3,779,4],[780,3,780,4],[781,3,781,4],[782,3,782,4],[783,3,783,4],[784,3,784,4],[785,3,785,4],[786,3,786,4],[787,3,787,4],[788,3,788,4],[789,3,789,4],[790,3,790,4],[791,3,791,4],[792,3,792,4],[793,3,793,4],[794,3,794,4],[795,3,795,4],[796,3,796,4],[797,3,797,4],[798,3,798,4],[799,3,799,4],[800,3,800,4],[801,3,801,4],[802,3,802,4],[803,3,803,4],[804,3,804,4],[805,3,805,4],[806,3,806,4],[807,3,807,4],[808,3,808,4],[809,3,809,4],[810,3,810,4],[811,3,811,4],[812,3,812,4],[813,3,813,4],[814,3,814,4],[815,3,815,4],[816,3,816,4],[817,3,817,4],[818,3,818,4],[819,3,819,4],[820,3,820,4],[821,3,821,4],[822,3,822,4],[823,3,823,4],[824,3,824,4],[825,3,825,4],[826,3,826,4],[827,3,827,4],[828,3,828,4],[829,3,829,4],[830,3,830,4],[831,3,831,4],[832,3,832,4],[833,3,833,4],[834,3,834,4],[835,3,835,4],[836,3,836,4],[837,3,837,4],[838,3,838,4],[839,3,839,4],[840,3,840,4],[841,3,841,4],[842,3,842,4],[843,3,843,4],[844,3,844,4],[845,3,845,4],[846,3,846,4],[847,3,847,4],[848,3,848,4],[849,3,849,4],[850,3,850,4],[851,3,851,4],[852,3,852,4],[853,3,853,4],[854,3,854,4],[855,3,855,4],[856,3,856,4],[857,3,857,4],[858,3,858,4],[859,3,859,4],[860,3,860,4],[861,3,861,4],[862,3,862,4],[863,3,863,4],[864,3,864,4],[865,3,865,4],[866,3,866,4],[867,3,867,4],[868,3,868,4],[869,3,869,4],[870,3,870,4],[871,3,871,4],[872,3,872,4],[873,3,873,4],[874,3,874,4],[875,3,875,4],[876,3,876,4],[877,3,877,4],[878,3,878,4],[879,3,879,4],[880,3,880,4],[881,3,881,4],[882,3,882,4],[883,3,883,4],[884,3,884,4],[885,3,885,4],[886,3,886,4],[887,3,887,4],[888,3,888,4],[889,3,889,4],[890,3,890,4],[891,3,891,4],[892,3,892,4],[893,3,893,4],[894,3,894,4],[895,3,895,4],[896,3,896,4],[897,3,897,4],[898,3,898,4],[899,3,899,4],[900,3,900,4],[901,3,901,4],[902,3,902,4],[903,3,903,4],[904,3,904,4],[905,3,905,4],[906,3,906,4],[907,3,907,4],[908,3,908,4],[909,3,909,4],[910,3,910,4],[911,3,911,4],[912,3,912,4],[913,3,913,4],[914,3,914,4],[915,3,915,4],[916,3,916,4],[917,3,917,4],[918,3,918,4],[919,3,919,4],[920,3,920,4],[921,3,921,4],[922,3,922,4],[923,3,923,4],[924,3,924,4],[925,3,925,4],[926,3,926,4],[927,3,927,4],[928,3,928,4],[929,3,929,4],[930,3,930,4],[931,3,931,4],[932,3,932,4],[933,3,933,4],[934,3,934,4],[935,3,935,4],[936,3,936,4],[937,3,937,4],[938,3,938,4],[939,3,939,4],[940,3,940,4],[941,3,941,4],[942,3,942,4],[943,3,943,4],[944,3,944,4],[945,3,945,4],[946,3,946,4],[947,3,947,4],[948,3,948,4],[949,3,949,4],[950,3,950,4],[951,3,951,4],[952,3,952,4],[953,3,953,4],[954,3,954,4],[955,3,955,4],[956,3,956,4],[957,3,957,4],[958,3,958,4],[959,3,959,4],[960,3,960,4],[961,3,961,4],[962,3,962,4],[963,3,963,4],[964,3,964,4],[965,3,965,4],[966,3,966,4],[967,3,967,4],[968,3,968,4],[969,3,969,4],[970,3,970,4],[971,3,971,4],[972,3,972,4],[973,3,973,4],[974,3,974,4],[975,3,975,4],[976,3,976,4],[977,3,977,4],[978,3,978,4],[979,3,979,4],[980,3,980,4],[981,3,981,4],[982,3,982,4],[983,3,983,4],[984,3,984,4],[985,3,985,4],[986,3,986,4],[987,3,987,4],[988,3,988,4],[989,3,989,4],[990,3,990,4],[991,3,991,4],[992,3,992,4],[993,3,993,4],[994,3,994,4],[995,3,995,4],[996,3,996,4],[997,3,997,4],[998,3,998,4],[999,3,999,4],[1000,3,1000,4],[1001,3,1001,4],[1002,3,1002,4],[1003,3,1003,4],[1004,3,1004,4],[1005,3,1005,4],[1006,3,1006,4],[1007,3,1007,4],[1008,3,1008,4],[1009,3,1009,4],[1010,3,1010,4],[1011,3,1011,4],[1014,3,1014,4],[1015,3,1015,4],[1016,3,1016,4],[1017,3,1017,4],[1018,3,1018,4],[1019,3,1019,4],[1020,3,1020,4],[1021,3,1021,4],[1022,3,1022,4],[1023,3,1023,4],[1024,3,1024,4],[1025,3,1025,4]],"merged_total":9228,"flags":["merged_cut"]}
[45,null,"40 Cronol.",null,"Gest. Pedg.",null,"Ley N° 29944",null,"Director(a)",null,"Pública",null,"EBA",null,{"$f":"SUMIF(anexo_01_07!C$25:C$34,LISTAS!P1,anexo_01_07!K$25:K$34)","v":0},"Director(a)",null,"Seleccione",{"$nulls":5},"Matemática",null,"Comunicación Integral",null,"Total Horas Pedagógicas",{"$nulls":3},"NOMBRE_IE","DISTRITO","CODMOD_IE","GESTION","NIVEL_EDUCATIVO","DIRECTOR","TELEFONO"]
[40,null,40,null,"Gest. Instit.",null,"Bolsa de horas",null,"Sub Director(a)",null,"Púb. Priv.",null,"JEC",null,{"$f":"SUMIF(anexo_01_07!C$25:C$34,LISTAS!P2,anexo_01_07!K$25:K$34)","v":0},"Sub Director(a)",null,"MATEMÁTICA",{"$f":"SUMIF(anexo_03_09!AZ$15:AZ$104,$R2,anexo_03_09!AY$15:AY$104)","v":20},null,20,null,null,"Comunicación en lengua originaria",null,"Matemática",null,"* Horas de Clase de Personal Directivo",null,"Si",null,"JOSE GABRIEL CONDORCANQUI","YANAOCA","0236653","Pública - Sector Educación","E.B.R. SECUNDARIA","CCOTO TACUSI, TEOFILO FORTUNATO",null,{"$f":"COUNTIF(DATA!$V$6:$V$3833,LISTAS!$AF2)","v":32}]
[35,null,32,{"$nulls":5},"Asesor (a)",null,"Privada",null,"JER",null,{"$f":"SUMIF(anexo_01_07!C$25:C$34,LISTAS!P3,anexo_01_07!K$25:K$34)","v":0},"Jerárquico(a)",null,"COMUNICACIÓN EN LENGUA ORIGINARIA",{"$f":"SUMIF(anexo_03_09!AZ$15:AZ$104,$R3,anexo_03_09!AY$15:AY$104)","v":15},null,15,null,null,"Castellano como segunda lengua",null,"Ciencia, Ambiente y Salud",null,"* Horas de Clase de Personal Jerárquico",null,"No",null,"FERNANDO TUPAC AMARU","TUPAC AMARU","0579391","Pública - Sector Educación","E.B.R. SECUNDARIA","SALAS SARAVIA, JESUS MANUEL",null,{"$f":"COUNTIF(DATA!$V$6:$V$3833,LISTAS!$AF3)","v":0}]
[25,null,"30",{"$nulls":5},"Coord. Académico",{"$nulls":5},{"$f":"SUMIF(anexo_01_07!C$25:C$34,LISTAS!P4,anexo_01_07!K$25:K$34)","v":169},"Prof. x Horas",null,"CASTELLANO COMO SEGUNDA LENGUA",{"$f":"SUMIF(anexo_03_09!AZ$15:AZ$104,$R4,anexo_03_09!AY$15:AY$104)","v":20},null,20,null,null,"Inglés",null,"Ciencias Sociales",null,"* Horas de Clase de Personal Coordinador",{"$nulls":3},"MICAELA BASTIDAS","PAMPAMARCA","0579409","Pública - Sector Educación","E.B.R. SECUNDARIA","CUNO MAMANI, CAROLINA VERONICA",null,{"$f":"COUNTIF(DATA!$V$6:$V$3833,LISTAS!$AF4)","v":8}]
[null,null,"29",{"$nulls":5},"Coord. Tutoria JEC",{"$nulls":8},"INGLÉS",{"$f":"SUMIF(anexo_03_09!AZ$15:AZ$104,$R5,anexo_03_09!AY$15:AY$104)","v":10},null,10,null,null,"Arte y Cultura",null,"Educación para el Trabajo",null,"* Horas de Clase de Personal Docente",{"$nulls":3},"SEÑOR DE EXALTACIÓN","QUEHUE","0579425","Pública - Sector Educación","E.B.R. SECUNDARIA","QUISPE FUENTES, DELIA",null,{"$f":"COUNTIF(DATA!$V$6:$V$3833,LISTAS!$AF5)","v":15}]
[null,null,"28",{"$nulls":5},"Coord. Pedagógico JEC",{"$nulls":8},"ARTE Y CULTURA",{"$f":"SUMIF(anexo_03_09!AZ$15:AZ$104,$R6,anexo_03_09!AY$15:AY$104)","v":10},null,10,null,null,"Ciencias Sociales",null,"Idioma extranjero",{"$nulls":5},"INDEPENDENCIA AMERICANA","YANAOCA","0791525","Pública - Sector Educación","E.B.R. SECUNDARIA","DELGADO ARTEAGA, JAIME",null,{"$f":"COUNTIF(DATA!$V$6:$V$3833,LISTAS!$AF6)","v":22}]
[null,null,"27",{"$nulls":5},"Jefe Departamento",{"$nulls":8},"CIENCIAS SOCIALES",{"$f":"SUMIF(anexo_03_09!AZ$15:AZ$104,$R7,anexo_03_09!AY$15:AY$104)","v":15},null,15,null,null,"Desarrollo Personal, ciudadanía y cívica",null,"Educación Religiosa",{"$nulls":5},"HAMPATURA","HAMPATURA","0931857","Pública - Sector Educación","E.B.R. SECUNDARIA","SERNA MARTINEZ, JUAN ADRIAN",null,{"$f":"COUNTIF(DATA!$V$6:$V$3833,LISTAS!$AF7)","v":14}]
[null,null,"26",{"$nulls":5},"Jefe Laboratorio",{"$nulls":8},"DESARROLLO PERSONAL, CIUDADANÍA Y CÍVICA",{"$f":"SUMIF(anexo_03_09!AZ$15:AZ$104,$R8,anexo_03_09!AY$15:AY$104)","v":15},null,15,null,null,"Educación Física",{"$nulls":7},"DANIEL ESTRADA PEREZ","MOSOCLLACTA","0931881","Pública - Sector Educación","E.B.R. SECUNDARIA","QUISPE SOTO, ROMULO",null,{"$f":"COUNTIF(DATA!$V$6:$V$3833,LISTAS!$AF8)","v":7}]
[null,null,"25",{"$nulls":5},"Jefe Taller",{"$nulls":8},"EDUCACIÓN FÍSICA",{"$f":"SUMIF(anexo_03_09!AZ$15:AZ$104,$R9,anexo_03_09!AY$15:AY$104)","v":15},null,15,null,null,"Educación Religiosa",{"$nulls":7},"SAN BARTOLOME","PATAQQUEÑA","0933317","Pública - Sector Educación","E.B.R. SECUNDARIA","ANAHUE BERNA, DOROTEO MARTIN",null,{"$f":"COUNTIF(DATA!$V$6:$V$3833,LISTAS!$AF9)","v":8}]
[null,null,"24",{"$nulls":3},"SI",null,"Jerárquico (a)",{"$nulls":8},"EDUCACIÓN RELIGIOSA",{"$f":"SUMIF(anexo_03_09!AZ$15:AZ$104,$R10,anexo_03_09!AY$15:AY$104)","v":10},null,10,null,null,"Ciencia y Tecnología",{"$nulls":7},"HIPOLITO TÚPAC AMARU","CHAUPIBANDA","1201540","Pública - Sector Educación","E.B.R. SECUNDARIA","MOGOLLON VILLANUEVA, ELISEO HUGO",null,{"$f":"COUNTIF(DATA!$V$6:$V$3833,LISTAS!$AF10)","v":7}]
[null,null,"23",{"$nulls":3},"NO",null,"Prof. AIP",{"$nulls":8},"CIENCIA Y TECNOLOGÍA",{"$f":"SUMIF(anexo_03_09!AZ$15:AZ$104,$R11,anexo_03_09!AY$15:AY$104)","v":20},null,20,null,null,"Educación para el Trabajo",{"$nulls":7},"LIBERTADOR TÚPAC AMARU","CCOCHAPATA","1201581","Pública - Sector Educación","E.B.R. SECUNDARIA","YANQUE SALINAS, MARIBEL",null,{"$f":"COUNTIF(DATA!$V$6:$V$3833,LISTAS!$AF11)","v":8}]
[null,null,"22",{"$nulls":5},"Prof. x Horas",{"$nulls":8},"EDUCACIÓN PARA EL TRABAJO",{"$f":"SUMIF(anexo_03_09!AZ$15:AZ$104,$R12,anexo_03_09!AY$15:AY$104)","v":15},null,15,null,null,"Tutoría y Orientación Educativa",{"$nulls":7},56108,"LLALLAPARA","1325059","Pública - Sector Educación","E.B.R. SECUNDARIA","ARENAS PALOMINO, LUIS ANGEL",null,{"$f":"COUNTIF(DATA!$V$6:$V$3833,LISTAS!$AF12)","v":7}]
[null,null,"21",{"$nulls":14},"TUTORÍA Y ORIENTACIÓN EDUCATIVA",{"$f":"SUMIF(anexo_03_09!AZ$15:AZ$104,$R13,anexo_03_09!AY$15:AY$104)","v":10},null,10,{"$nulls":10},56113,"CCANCCAYLLO","1325067","Pública - Sector Educación","E.B.R. SECUNDARIA","GUTIERREZ VILCA, IVAN",null,{"$f":"COUNTIF(DATA!$V$6:$V$3833,LISTAS!$AF13)","v":7}]
[null,null,"20",{"$nulls":15},{"$f":"SUMIF(anexo_03_09!AZ$15:AZ$104,$R14,anexo_03_09!AY$15:AY$104)","v":0},null,0,{"$nulls":10},56392,"KAYNO","1325075","Pública - Sector Educación","E.B.R. SECUNDARIA","SACSI QUISPE, MARIO",null,{"$f":"COUNTIF(DATA!$V$6:$V$3833,LISTAS!$AF14)","v":7}]
[null,null,"19",{"$nulls":15},{"$f":"SUMIF(anexo_03_09!AZ$15:AZ$104,#REF!,anexo_03_09!AY$15:AY$104)","v":0},null,0,{"$nulls":10},56267,"TOTORA","1325083","Pública - Sector Educación","E.B.R. SECUNDARIA","HUAYCHO CCAHUANA, REYNALDO",null,{"$f":"COUNTIF(DATA!$V$6:$V$3833,LISTAS!$AF15)","v":7}]
[null,null,"18",{"$nulls":15},{"$f":"SUMIF(anexo_03_09!AZ$15:AZ$104,#REF!,anexo_03_09!AY$15:AY$104)","v":0},{"$nulls":12},56110,"CHUCCHUCALLA","1349471","Pública - Sector Educación","E.B.R. SECUNDARIA","LOPINTA CHIRINOS, YONY NOEMY",null,{"$f":"COUNTIF(DATA!$V$6:$V$3833,LISTAS!$AF16)","v":7}]
[null,null,"17",{"$nulls":15},{"$f":"SUMIF(anexo_03_09!AZ$15:AZ$104,$R7,anexo_03_09!AY$15:AY$104)","v":15},{"$nulls":12},56283,"JALCCO","1349489","Pública - Sector Educación","E.B.R. SECUNDARIA","PINTO HUANACO, BAILON EDGAR",null,{"$f":"COUNTIF(DATA!$V$6:$V$3833,LISTAS!$AF17)","v":7}]
[null,null,"16",{"$nulls":15},{"$f":"SUMIF(anexo_03_09!AZ$15:AZ$104,#REF!,anexo_03_09!AY$15:AY$104)","v":0},{"$nulls":12},"CPED - 56378","CHOCCAYHUA","1377183","Pública - Sector Educación","E.B.R. SECUNDARIA","MAMANI CLEMENTE, WALTER",null,{"$f":"COUNTIF(DATA!$V$6:$V$3833,LISTAS!$AF18)","v":3}]
[null,null,"15",{"$nulls":15},{"$f":"SUMIF(anexo_03_09!AZ$15:AZ$104,#REF!,anexo_03_09!AY$15:AY$104)","v":0},{"$nulls":12},"RICARDO PALMA","PONGOÑA","1390087","Pública - Sector Educación","E.B.R. SECUNDARIA","QUISPICHO AMAT, BELTRAN",null,{"$f":"COUNTIF(DATA!$V$6:$V$3833,LISTAS!$AF19)","v":7}]
[null,null,"14",{"$nulls":15},{"$f":"SUMIF(anexo_03_09!AZ$15:AZ$104,$R8,anexo_03_09!AY$15:AY$104)","v":15},{"$nulls":12},"SAN JUAN BAUTISTA","HUINCHIRI","1390095","Pública - Sector Educación","E.B.R. SECUNDARIA","PARHUAYO PUMA, REYNALDO",null,{"$f":"COUNTIF(DATA!$V$6:$V$3833,LISTAS!$AF20)","v":7}]
[null,null,"13",{"$nulls":15},{"$f":"SUMIF(anexo_03_09!AZ$15:AZ$104,#REF!,anexo_03_09!AY$15:AY$104)","v":0},{"$nulls":12},"INCA TUPAC AMARU","SURIMANA","1390111","Pública - Sector Educación","E.B.R. SECUNDARIA","QUISPE SURCO, OMAR",null,{"$f":"COUNTIF(DATA!$V$6:$V$3833,LISTAS!$AF21)","v":7}]
[null,null,"12",{"$nulls":15},{"$f":"SUMIF(anexo_03_09!AZ$15:AZ$104,#REF!,anexo_03_09!AY$15:AY$104)","v":0},{"$nulls":12},"FERNANDO BELAUNDE TERRI","AUSANTA","1390129","Pública - Sector Educación","E.B.R. SECUNDARIA","APASA CHOQUEPUMA, ZACARIAS",null,{"$f":"COUNTIF(DATA!$V$6:$V$3833,LISTAS!$AF22)","v":7}]
[null,null,"11",{"$nulls":14},"Reforzamiento, nivelación y recuperacion para estudiantes",{"$f":"SUMIF(anexo_03_09!AZ$15:AZ$104,$R9,anexo_03_09!AY$15:AY$104)","v":15},{"$nulls":19},{"$f":"COUNTIF(DATA!$V$6:$V$3833,LISTAS!$AF23)","v":0}]
[null,null,"10",{"$nulls":14},"Planificación de unidades didácticas y sesiones",{"$f":"SUMIF(anexo_03_09!AZ$15:AZ$104,#REF!,anexo_03_09!AY$15:AY$104)","v":0}]
[null,null,"09",{"$nulls":14},"Asesoria personalizada a estudiantes",{"$f":"SUMIF(anexo_03_09!AZ$15:AZ$104,#REF!,anexo_03_09!AY$15:AY$104)","v":0}]
[null,null,"08",{"$nulls":14},"Atención a la Familia del estudiante",{"$f":"SUMIF(anexo_03_09!AZ$15:AZ$104,$R10,anexo_03_09!AY$15:AY$104)","v":10}]
[null,null,"07",{"$nulls":14},"Apoyo en el monitoreo y acompañamiento de pares",{"$f":"SUMIF(anexo_03_09!AZ$15:AZ$104,#REF!,anexo_03_09!AY$15:AY$104)","v":0}]
[null,null,"06",{"$nulls":14},"Planificación , organización de las actividades institucionales de la IIEE",{"$f":"SUMIF(anexo_03_09!AZ$15:AZ$104,#REF!,anexo_03_09!AY$15:AY$104)","v":0}]
[null,null,"05",{"$nulls":14},"Investigación diagnostica de la realidad de los estudiantes",{"$f":"SUMIF(anexo_03_09!AZ$15:AZ$104,$R11,anexo_03_09!AY$15:AY$104)","v":20}]
[null,null,"04",{"$nulls":15},{"$f":"SUMIF(anexo_03_09!AZ$15:AZ$104,$R30,anexo_03_09!AY$15:AY$104)","v":0}]
[null,null,"03",{"$nulls":15},{"$f":"SUMIF(anexo_03_09!AZ$15:AZ$104,$R31,anexo_03_09!AY$15:AY$104)","v":0}]
[null,null,"02",{"$nulls":15},{"$f":"SUMIF(anexo_03_09!AZ$15:AZ$104,$R12,anexo_03_09!AY$15:AY$104)","v":15}]
[null,null,"01",{"$nulls":15},{"$f":"SUMIF(anexo_03_09!AZ$15:AZ$104,#REF!,anexo_03_09!AY$15:AY$104)","v":0}]
[{"$nulls":18},{"$f":"SUMIF(anexo_03_09!AZ$15:AZ$104,#REF!,anexo_03_09!AY$15:AY$104)","v":0}]
[{"$nulls":18},{"$f":"SUMIF(anexo_03_09!AZ$15:AZ$104,$R13,anexo_03_09!AY$15:AY$104)","v":10}]
[{"$nulls":18},{"$f":"SUMIF(anexo_03_09!AZ$15:AZ$104,$R36,anexo_03_09!AY$15:AY$104)","v":0}]
[{"$nulls":18},{"$f":"SUMIF(anexo_03_09!AZ$15:AZ$104,$R37,anexo_03_09!AY$15:AY$104)","v":0}]
[{"$nulls":18},{"$f":"SUMIF(anexo_03_09!AZ$15:AZ$104,$R14,anexo_03_09!AY$15:AY$104)","v":0}]
[{"$nulls":18},{"$f":"SUMIF(anexo_03_09!AZ$15:AZ$104,$R39,anexo_03_09!AY$15:AY$104)","v":0}]
[{"$nulls":18},{"$f":"SUMIF(anexo_03_09!AZ$15:AZ$104,$R15,anexo_03_09!AY$15:AY$104)","v":0}]
[{"$nulls":18},{"$f":"SUMIF(anexo_03_09!AZ$15:AZ$104,$R41,anexo_03_09!AY$15:AY$104)","v":0}]
[{"$nulls":18},{"$f":"SUMIF(anexo_03_09!AZ$15:AZ$104,$R16,anexo_03_09!AY$15:AY$104)","v":0}]
[{"$nulls":18},{"$f":"SUMIF(anexo_03_09!AZ$15:AZ$104,$R17,anexo_03_09!AY$15:AY$104)","v":0}]
[{"$nulls":18},{"$f":"SUMIF(anexo_03_09!AZ$15:AZ$104,$R18,anexo_03_09!AY$15:AY$104)","v":0}]
[{"$nulls":18},{"$f":"SUMIF(anexo_03_09!AZ$15:AZ$104,$R19,anexo_03_09!AY$15:AY$104)","v":0}]
[{"$nulls":18},{"$f":"SUMIF(anexo_03_09!AZ$15:AZ$104,$R20,anexo_03_09!AY$15:AY$104)","v":0}]
[{"$nulls":18},{"$f":"SUM(S2:S46)","v":275}]

{"sheet":"Hoja2","index":13,"n_rows":17,"n_cols":3,"rows_kept":17,"hidden":true}
["AREA","JES","JEC"]
["MATEMATICA",4,6]
["COMUNICACIÓN",4,5]
["INGLES",3,5]
["ARTE Y CULTURA",3,3]
["CIENCIAS SOCIALES",3,4]
["DESARROLLO PERSONAL, CIUDADANIA Y CIVICA",3,4]
["EDUCACION FISICA",3,3]
["EDUCACION RELIGIOSA",2,2]
["CIENCIA Y TECNOLOGIA",4,5]
["EDUCACION PARA EL TRABAJO",2,3]
["TUTORIA Y ORIENTACION EDUCATIVA",2,2]
["HORAS DE LIBRE DISPONIBILIDAD",2,3]
[null,{"$f":"SUM(B2:B13)","v":35},{"$f":"SUM(C2:C13)","v":45}]
[]
[]
[null,6,8]